FR FieldReady Academy
CT scanners · PQ family

Philips PQ: troubleshooting and error codes

The ServiceForge knowledge base holds 569 documented symptoms for the Philips PQ, with 667 ranked causes, 1258 diagnostic checks with test points and expected values, and 948 error codes. Each symptom below shows its causes and the first check; the rest is one connection away. Connect ServiceForge to your AI

Symptoms

Floppy LED does not flash

LED indicator on floppy drive should flash on and off during boot sequence but does not

Ranked causes

  1. 1. Power connector disconnected or loose to floppy drive or controller (common)
  2. 2. SCSI cable disconnected or faulty (common)
  3. 3. Floppy drive or controller jumpers incorrectly set (common)
  4. 4. SCSI ID conflict or duplicate ID (occasional)
  5. 5. SCSI termination missing or incorrect (occasional)
  6. 6. Floppy controller or drive failure (rare)
First check

Cycle power to system

Test point
Power button
Expected
LED flashes during boot sequence

7 more checks with pass and fail actions, 6 corrective actions, and part numbers are in ServiceForge. Connect ServiceForge to your AI

Archive cassette drive does not respond to command

Orange LED not lit; tape drive unresponsive to commands from system

Ranked causes

  1. 1. Tape media issue or bad connection (common)
  2. 2. SCSI cable not seated properly (common)
  3. 3. SCSI terminator issue (occasional)
  4. 4. Incorrect SCSI ID configuration (occasional)
  5. 5. Tape drive firmware issue (occasional)
First check

Listen for tape drive spinup

Test point
tape drive motor
Expected
spinup sound audible

5 corrective actions and part numbers are in ServiceForge. Connect ServiceForge to your AI

No gantry motion on bootup caution

Gantry does not move during system startup sequence

Ranked causes

  1. 1. Gullwing interlock switch in interlock position (common)
  2. 2. Drives interlock switch on AC Control Box in interlock position (common)
  3. 3. Fuses F310, F311, or F312 blown (occasional)
  4. 4. Servo drive power supply improper voltage (occasional)
  5. 5. Error logged in Error Logger program (unknown)
First check

Verify gullwing interlock switch position

Test point
Gullwing interlock switch
Expected
Not in interlock position

5 more checks with pass and fail actions, 5 corrective actions, and part numbers are in ServiceForge. Connect ServiceForge to your AI

Parameter error (PARAM_ERR) generated by calfmr

System generates PARAM_ERR when calfmr receives out-of-range parameter from optable, control, or database during calibration operations

Ranked causes

  1. 1. MA offset parameter out of range (common)
  2. 2. Invalid command from CALM to CALF (occasional)
  3. 3. Calibration buffer handle mismatch (occasional)
  4. 4. Calibration file size mismatch (occasional)
  5. 5. Parameter size out of range for calibration type (occasional)
First check

Verify MA offset parameter validity

Test point
MA_offset calculation
Expected
Parameter within valid range calculated from SCAN MA and AirCal MA

3 more checks with pass and fail actions, 5 corrective actions, and part numbers are in ServiceForge. Connect ServiceForge to your AI

Tape drive does not spin up

Archive tape drive fails to spin when activated

Ranked causes

  1. 1. Power supply issue (common)
  2. 2. Defective tape (occasional)
  3. 3. SCSI cable connection issue (common)
  4. 4. SCSI terminator misconfiguration (occasional)
  5. 5. SCSI ID conflict (occasional)
First check

Check power to tape drive

Test point
Power connector
Expected
Power present

4 more checks with pass and fail actions, 5 corrective actions, and part numbers are in ServiceForge. Connect ServiceForge to your AI

Tape intermittently ejects during archive operation

Tape drive intermittently kicks out or ejects tape during archive/hardcopy operations

Ranked causes

  1. 1. Defective or incompatible tape (common)
  2. 2. SCSI cable connection loose or unseated (common)
  3. 3. SCSI terminator configuration incorrect (common)
  4. 4. Tape drive malfunction (occasional)
  5. 5. Power supply voltage out of specification (occasional)
First check

Try new tape cartridge

Test point
Tape drive
Expected
Tape operates without ejecting

4 more checks with pass and fail actions, 5 corrective actions, and part numbers are in ServiceForge. Connect ServiceForge to your AI

ELTP touch panel not responding

Touch panel screen not responding to user input; no menus or data displayed when activated

Ranked causes

  1. 1. Power or cable continuity failure (common)
  2. 2. Improper jumper settings or connector pin configuration (occasional)
  3. 3. Serial communication cable fault (occasional)
  4. 4. ELTP module or circuit failure (rare)
First check

Verify ELTP power supply and visual checks

Test point
Power connector and cable
Expected
Power connected; no visible cable damage

4 more checks with pass and fail actions, 4 corrective actions, and part numbers are in ServiceForge. Connect ServiceForge to your AI

Hard drive does not spin up

Hard drive fails to spin up; system exhibits SCSI failure

Ranked causes

  1. 1. Loose or disconnected SCSI cable (common)
  2. 2. Loose or disconnected power cable (common)
  3. 3. SCSI bus malfunction or device conflict (occasional)
  4. 4. Failed tape or floppy drive affecting SCSI chain (occasional)
First check

Verify SCSI cable connection

Test point
SCSI connector at hard drive and controller
Expected
Firmly seated connection

3 more checks with pass and fail actions, 4 corrective actions, and part numbers are in ServiceForge. Connect ServiceForge to your AI

AC input chassis removal procedure high voltage

Removal of AC input chassis from scan frame requires cable disconnection, mounting bolt removal, and careful handling due to heavy weight (68.5-106.0 lbs depending on model)

Ranked causes

  1. 1. AC input chassis requires removal for service or replacement (unknown)
  2. 2. Heavy weight of AC input chassis (68.5-106.0 lbs) (common)
  3. 3. Lifting bracket availability varies by model (common)

7 corrective actions and part numbers are in ServiceForge. Connect ServiceForge to your AI

ANB error in SIF communications

Serial communication error between SIF and GPU or SIF and XSC; ASCII message indicates error type and port in error

Ranked causes

  1. 1. Maximum number of retries (common)
  2. 2. Maximum number of errors (parity or checksum errors) (occasional)
  3. 3. Operating system overload or ANB software problem (rare)
First check

Examine ASCII error message for error type and port number

Test point
Console or log display
Expected
Error name, error detected, and port in error clearly visible

1 more check with pass and fail actions, 3 corrective actions, and part numbers are in ServiceForge. Connect ServiceForge to your AI

ANB error in SIF-GPU or SIF-XSC communication

Serial communication protocol error between SIF and GPU or SIF-XSC with ASCII message containing error name, detected error type, and port information

Ranked causes

  1. 1. Maximum number of retries - complete lack of communication in at least one direction (common)
  2. 2. Maximum number of errors - parity or checksum errors detected by SIF (occasional)
  3. 3. Operating system overload or ANB software problems (rare)
First check

Examine ASCII error message for error name, detected error type, and port information

Test point
SIF error display
Expected
Error message with 3 pieces of information

2 more checks with pass and fail actions are in ServiceForge. Connect ServiceForge to your AI

Archive does not load tape

Tape archive system fails to load or recognize tape cartridges

Ranked causes

  1. 1. SCSI connection or termination issue (common)
  2. 2. Defective tape cartridge (common)
  3. 3. Tape drive requires reboot (occasional)
First check

Reseat SCSI cables

Test point
SCSI connector
Expected
Secure connection

5 more checks with pass and fail actions, 5 corrective actions, and part numbers are in ServiceForge. Connect ServiceForge to your AI

Calibration: Solenoid and switch adjustment

Position ball bearing on solenoid arm, set microswitch clearance to specification, and tighten fasteners to ensure proper actuator engagement.

Ranked causes

  1. 1. Ball bearing not centered on actuator (common)
  2. 2. Microswitch not positioned for proper closure (common)
  3. 3. Excessive clearance between switch and actuator blade (common)
First check

Verify ball bearing is centered on actuator

Test point
Ball bearing center, actuator position
Expected
Ball bearing center aligned with actuator

4 more checks with pass and fail actions, 3 corrective actions, and part numbers are in ServiceForge. Connect ServiceForge to your AI

Database key value changed unexpectedly

Key value in database changed without expected action

Ranked causes

  1. 1. Database configuration file .DBP changed without rebuilding databases (common)
  2. 2. Databases rebuilt without shutting down first (occasional)
  3. 3. CPU board memory is being clobbered (rare)

3 corrective actions and part numbers are in ServiceForge. Connect ServiceForge to your AI

Detector module replacement criteria

Criteria for replacing detector modules based on pattern and count of bad channels detected during calibration procedures.

Ranked causes

  1. 1. Excessive bad channels in detector module (occasional)
  2. 2. Adjacent bad channels detected (occasional)
  3. 3. Bad channel affecting other channels in quadrature manner (rare)

3 corrective actions and part numbers are in ServiceForge. Connect ServiceForge to your AI

Gantry tilt movement abnormal patient safety

Tilt display flashing or blank; gantry tilts with excessive noise; movement is erratic; limit switches do not stop tilt

Ranked causes

  1. 1. Tilt transducer position feedback error or misalignment (occasional)
  2. 2. Tilt motor circuit fault (occasional)
  3. 3. Tilt limit switch failure (occasional)
First check

Verify gantry moves in both tilt directions

Test point
Gantry with Gantry Control Panel switches for forward/backward tilt
Expected
Smooth movement forward and backward; no stalling

4 more checks with pass and fail actions, 3 corrective actions, and part numbers are in ServiceForge. Connect ServiceForge to your AI

Hard drive 60 does not load heads

Drive fails to load read/write heads; may be detected as offline or unresponsive in SCSI diagnostics

Ranked causes

  1. 1. No power to drive (common)
  2. 2. SCSI or power cable loose or incorrectly seated (common)
  3. 3. Drive failure (occasional)
First check

Verify power supply to hard drive 60

Test point
Drive power connector
Expected
Power present

2 more checks with pass and fail actions, 3 corrective actions, and part numbers are in ServiceForge. Connect ServiceForge to your AI

Patient Support horizontal (table top) movement abnormal patient safety

Horizontal display flashing or blank; table top moves erratically or with excessive noise; limit switches do not stop movement

Ranked causes

  1. 1. Horizontal transducer position feedback error (occasional)
  2. 2. Horizontal motor or drive circuit malfunction (occasional)
  3. 3. Limit switch failure at horizontal extremes (occasional)
First check

Verify table top moves in both directions

Test point
Table top with Gantry Control Panel switches
Expected
Smooth in/out motion; no stalling or excessive resistance

4 more checks with pass and fail actions, 3 corrective actions, and part numbers are in ServiceForge. Connect ServiceForge to your AI

Patient Support vertical movement abnormal patient safety

Vertical display flashing, blank, shows erratic numbers, or Patient Support moves with excessive noise, stalling, or jerky motion

Ranked causes

  1. 1. Vertical transducer malfunction or position feedback error (occasional)
  2. 2. Limit switch failure or misalignment (occasional)
  3. 3. Vertical motor drive circuit fault (occasional)
First check

Verify Patient Support moves in both directions

Test point
Patient Support with Gantry Control Panel switches
Expected
Smooth upward and downward motion in both directions

4 more checks with pass and fail actions, 3 corrective actions, and part numbers are in ServiceForge. Connect ServiceForge to your AI

ARDAS detector module non-functioning radiation

Individual ARDAS detector module fails performance verification during autocalibration; scatter channel not working as expected; potential image artifacts if module is in critical position

Ranked causes

  1. 1. ARDAS detector module failure at critical position (0-19, 40-79, 100-119) (unknown)
  2. 2. ARDAS detector module failure at non-critical position (unknown)
First check

Run ARDAS detector verification autocalibration program

Test point
All ARDAS detector channels
Expected
Individual module means within range of global mean; scatter channel functional
Tools
CT autocalibration software

4 more checks with pass and fail actions, 2 corrective actions, and part numbers are in ServiceForge. Connect ServiceForge to your AI

Auto Voice character response error

Command 8 sent to Auto Voice; console receives improper character count in response; timeout or missing characters returned

Ranked causes

  1. 1. Intercom volume turned down or audio circuit failure (common)
  2. 2. Serial communication or Auto Voice module failure (occasional)
First check

Verify intercom volume setting

Test point
Intercom volume control
Expected
Volume turned up (non-minimum setting)

1 more check with pass and fail actions, 2 corrective actions, and part numbers are in ServiceForge. Connect ServiceForge to your AI

Background zero test - channels out of specification

Some detector channels exhibit response values outside specification limits

Ranked causes

  1. 1. Detector channel response drift or malfunction (occasional)
  2. 2. Channel noise or offset calibration error (occasional)

2 corrective actions and part numbers are in ServiceForge. Connect ServiceForge to your AI

Ballscrew drive damage during support lowering caution

Vertical support brace must be removed before lowering patient support; leaving brace in place will damage ballscrew drive mechanism

Ranked causes

  1. 1. Vertical support brace left in place during lowering (occasional)
  2. 2. Vertical support brace not returned to holder (occasional)
First check

Verify vertical support brace is removed before lowering patient support

Test point
vertical support brace position
Expected
brace removed and stored in holder

1 more check with pass and fail actions, 2 corrective actions, and part numbers are in ServiceForge. Connect ServiceForge to your AI

Brake makes excessive noise during operation caution

Loud chattering or abnormal noise from brake during vertical motion control

Ranked causes

  1. 1. Brake hub not properly aligned (common)
  2. 2. Brake wiring connections loose or disconnected (occasional)
First check

Listen for excessive noise during patient support raise/lower cycles

Test point
Brake area audible inspection
Expected
Normal brake operation; minimal or no chattering

2 corrective actions and part numbers are in ServiceForge. Connect ServiceForge to your AI

Button timeout error on System Monitor Board caution

Timeout occurs when button not pressed before test timeout period expires or button is defective

Ranked causes

  1. 1. Button not pressed within timeout period (common)
  2. 2. Button defective or intermittent (occasional)
First check

Verify button press is detected within timeout window

Test point
Button input port
Expected
Button Hit Detected message displayed

2 corrective actions and part numbers are in ServiceForge. Connect ServiceForge to your AI

Calibration Request error (NOCALFILE_ERR)

Requested calibration file cannot be found or accessed

Ranked causes

  1. 1. Scanner not completely calibrated for all protocols (common)
  2. 2. Calibration file not found or unreadable on disk (occasional)

Calibration: Center calibration

Generation of centering constants for detector positioning and scan frame circularity correction during autocalibration

Ranked causes

  1. 1. Detector center position variation across tilt angles (common)
  2. 2. Scan frame not perfectly circular (common)
First check

Verify generation of global centering constants

Test point
Centering calibration file
Expected
61 Global Constants in output file

1 more check with pass and fail actions, 2 corrective actions, and part numbers are in ServiceForge. Connect ServiceForge to your AI

Calibration: Gantry Processor Unit DIP switch configuration high voltage

Set/verify DIP switch settings on wire wrap versions of GPU circuit card

Ranked causes

  1. 1. DIP switches require initial configuration or verification (common)
  2. 2. Static discharge risk during PCB handling (common)

5 corrective actions and part numbers are in ServiceForge. Connect ServiceForge to your AI

Calibration: GPU DIP switch configuration high voltage

Set or verify DIP switch settings on GPU circuit card wire wrap versions to ensure correct gantry processor unit configuration

Ranked causes

  1. 1. DIP switches require initial setup or verification (common)
  2. 2. High voltage hazard during open gantry service (common)
First check

Verify gantry power is off

Test point
Main power disconnect
Expected
Power removed per Power Up/Down procedures

4 more checks with pass and fail actions, 6 corrective actions, and part numbers are in ServiceForge. Connect ServiceForge to your AI

Calibration: Patient Support vertical position

Adjust vertical zero and scale potentiometers on CTCC card to calibrate patient couch height; verify display word 9 values and physical measurements at upper and lower limits

Ranked causes

  1. 1. Vertical zero potentiometer out of adjustment (unknown)
  2. 2. Vertical scale potentiometer out of adjustment (unknown)
First check

Access Regulus screen and cocal program

Test point
Gantry interface
Expected
cocal menu with option #5 available

12 more checks with pass and fail actions, 2 corrective actions, and part numbers are in ServiceForge. Connect ServiceForge to your AI

Calibration: Scan drive offset and phasing

RDC offset and Motor Pole offset adjustment for X-ray beam detector alignment and servo motor phase relationship

Ranked causes

  1. 1. RDC offset requires adjustment for detector zero alignment (common)
  2. 2. Motor Pole offset requires adjustment for servo phase relationship (common)
First check

Remove gantry power

Test point
ELTP
Expected
Gantry Powerdown option selected

7 more checks with pass and fail actions, 2 corrective actions, and part numbers are in ServiceForge. Connect ServiceForge to your AI

Calibration: Scan drive resolver offset high voltage

Adjust RDC offset switches so Fine RDC circuit output is zero when X-ray center beam points at detector zero; adjust Motor Pole offset switches to align phase relationship between A, B, C commands and stator voltages to prevent smooth rotation failure or backward rotation attempts

Ranked causes

  1. 1. Resolver offset requires calibration after resolver replacement or PMDC replacement with settings change (occasional)
  2. 2. Poor image quality, intercom noise, or gantry vibration from excessive resolver error (occasional)

6 corrective actions and part numbers are in ServiceForge. Connect ServiceForge to your AI

Calibration: X-ray drift evaluation radiation

Performance utility to assess X-ray generation equipment stability during high voltage startup; collects data 50 msecs after HV generator powers up and displays stability information from detectors numerically or graphically

Ranked causes

  1. 1. Delta Data enabled (common)
  2. 2. Pilot source fans data not enabled (common)
First check

Verify pilot source fans data save is enabled

Test point
site_cnf program menu
Expected
Pilot source fans data save enabled

1 more check with pass and fail actions, 2 corrective actions, and part numbers are in ServiceForge. Connect ServiceForge to your AI

Calibration: X-ray tube center positioning radiation

Lateral and global positioning errors detected during centering calibration scan; tube may be misaligned relative to detector center

Ranked causes

  1. 1. Tube lateral misalignment exceeds tolerance (>0.005 in.) (unknown)
  2. 2. Tube lateral misalignment within tolerance (<0.005 in.) (unknown)
First check

Scan centering pin using CENTER CAL protocol

Test point
Scanner utility test protocols
Expected
CENTER CAL protocol selected; large focal spot; Comp=Norm
Tools
Scanner utility

4 more checks with pass and fail actions, 2 corrective actions, and part numbers are in ServiceForge. Connect ServiceForge to your AI

Couch collision with gantry during diagnostic movement patient safety

Patient couch moves during Couch Drive Diagnostic test and may extend into gantry, risking collision with objects or personnel

Ranked causes

  1. 1. Objects left on couch during diagnostic execution (common)
  2. 2. Personnel in couch or gantry path during motion (common)
First check

Verify couch surface is clear of all objects

Test point
Patient couch platform
Expected
No objects present on couch

1 more check with pass and fail actions, 2 corrective actions, and part numbers are in ServiceForge. Connect ServiceForge to your AI

Couch position error during pilot scan patient safety

Error message displayed: 'couch position must be outside of view, 450mm or less' with actual couch position value shown. Occurs when pilot scan includes objects in scan field.

Ranked causes

  1. 1. Table incremented too far into scan circle (common)
  2. 2. Phantom or object protruding into scan field during pilot scan (common)
First check

Verify couch position outside scan circle

Test point
Couch
Expected
Position 450mm or less from scan circle edge

1 more check with pass and fail actions, 2 corrective actions, and part numbers are in ServiceForge. Connect ServiceForge to your AI

Detector number sequencing error patient safety

Detector numbers in scan data are not in sequential order, possibly due to aborted scan reprocessing

Ranked causes

  1. 1. Reprocessing of aborted or incomplete scan (occasional)
  2. 2. Detector hardware malfunction or data corruption (rare)

Disk write error

System unable to write to disk, often accompanied by full disk or corrupted filesystem messages

Ranked causes

  1. 1. Disk partition "/usr" is full (common)
  2. 2. Regulus filesystem on "/usr" is corrupted (common)

2 corrective actions and part numbers are in ServiceForge. Connect ServiceForge to your AI

EL touch panel inoperative after replacement

Touch panel commands do not execute or system does not respond to panel input

Ranked causes

  1. 1. Touch panel not properly connected or installed (common)
  2. 2. Mounting nuts and washers not properly secured (occasional)
First check

Verify cable connections at touch panel PCB

Test point
Lower right corner of touch panel PCB
Expected
Both cables firmly seated and engaged

1 more check with pass and fail actions, 2 corrective actions, and part numbers are in ServiceForge. Connect ServiceForge to your AI

Environmental sensor error reported in Error Logger

Error Logger displays name and location of tripped environmental sensor

Ranked causes

  1. 1. Air flow sensor obstruction (common)
  2. 2. Temperature sensor lead disconnected (common)
First check

Access Error Logger to identify tripped sensor

Test point
Error Logger
Expected
Sensor name and location displayed

1 more check with pass and fail actions, 3 corrective actions, and part numbers are in ServiceForge. Connect ServiceForge to your AI

Error on alert board detected during pre-scan check

SCAREMAN test at scan start detects SIF or MPM in crash condition and displays error message naming the board

Ranked causes

  1. 1. SIF in crash condition (unknown)
  2. 2. MPM in crash condition (unknown)

2 corrective actions and part numbers are in ServiceForge. Connect ServiceForge to your AI

Gantry cannot be turned off from service panel

Gantry does not power down when attempting to turn off after service work or troubleshooting from the Gantry Service Panel.

Ranked causes

  1. 1. Emergency Stop Pushbutton not depressed (common)
  2. 2. Service/O/Normal keyswitch not returned to Normal position (common)
First check

Depress Emergency Stop Pushbutton

Test point
Any Emergency Stop Pushbutton on Gantry Service Panel
Expected
Gantry stops immediately

1 more check with pass and fail actions, 2 corrective actions, and part numbers are in ServiceForge. Connect ServiceForge to your AI

Gantry cannot be turned on from service panel

Gantry does not respond when attempting to power on using the Gantry Service Panel during service, troubleshooting or preventive maintenance.

Ranked causes

  1. 1. Service/O/Normal keyswitch not in Service position (common)
  2. 2. START pushbutton not pressed (common)
First check

Verify Service/O/Normal keyswitch position

Test point
Service/O/Normal keyswitch on Gantry Service Panel
Expected
Service position

1 more check with pass and fail actions, 2 corrective actions, and part numbers are in ServiceForge. Connect ServiceForge to your AI

Gantry covers removed - dangerous voltage exposure high voltage

Technician operating or working on equipment with gantry covers removed may contact exposed dangerous voltages

Ranked causes

  1. 1. Service procedure requires gantry covers to be removed (common)
  2. 2. Exposed high-voltage circuits in gantry assembly (common)

4 corrective actions and part numbers are in ServiceForge. Connect ServiceForge to your AI

Gantry power-up verification incomplete radiation

System not yet powered up or tube type not verified before applying gantry power

Ranked causes

  1. 1. Tube type not verified before gantry power-up (common)
  2. 2. Tube type mismatch detected (rare)
First check

Apply power to console only

Test point
console power switch
Expected
console fully powered and ready for command input

1 more check with pass and fail actions, 2 corrective actions, and part numbers are in ServiceForge. Connect ServiceForge to your AI

Gantry spins in reverse direction after boot caution

On system startup, the gantry rotates in opposite direction from normal operation

Ranked causes

  1. 1. Incorrect motor pole offset setting (common)
  2. 2. Motor control circuit malfunction or incorrect wiring (occasional)
First check

Verify motor pole offset setting is correct

Test point
Motor pole offset configuration
Expected
Setting configured for normal (forward) direction rotation

2 corrective actions and part numbers are in ServiceForge. Connect ServiceForge to your AI

Intercom PCB replacement high voltage

Remove and replace the console intercom PCB as part of maintenance or repair

Ranked causes

  1. 1. Intercom PCB requires replacement (unknown)
  2. 2. Equipment exposure to high voltage during open-cover work (common)
First check

Remove console power

Test point
Console power supply
Expected
Power removed per powerup/powerdown procedure

12 more checks with pass and fail actions, 10 corrective actions, and part numbers are in ServiceForge. Connect ServiceForge to your AI

Intercom speaker or microphone not operating

Speaker or microphone functionality fails after microphone PCB replacement or during normal operation

Ranked causes

  1. 1. Microphone PCB not properly seated or connector misaligned (common)
  2. 2. Defective replacement microphone PCB (occasional)
First check

Verify microphone PCB is firmly pressed against mounting surface

Test point
PCB mounting area inside cone
Expected
PCB seated flush with secure contact

3 more checks with pass and fail actions, 2 corrective actions, and part numbers are in ServiceForge. Connect ServiceForge to your AI

Invalid GPU command

GPU receives invalid command from SIF touchpanel interface

Ranked causes

  1. 1. GPU not programmed to understand command (occasional)
  2. 2. GPU in state that cannot accept command (occasional)

ISAM error 200 or higher

ISAM error code 200 or above indicates memory corruption or untested software

Ranked causes

  1. 1. Computer memory is corrupt, probable hardware failure on CPU board (occasional)
  2. 2. Untested software is clobbering memory (occasional)

Loose cables or restricted travel detected caution

Cables loose or catching during scan frame rotation; clearance issues between rotating and stationary frame cables.

Ranked causes

  1. 1. Loose cables in rotating assembly (occasional)
  2. 2. Insufficient clearance between rotating and stationary frame cables (occasional)
First check

Rotate scan frame counterclockwise by hand

Test point
Entire rotation range
Expected
No loose cables; smooth rotation without resistance

1 more check with pass and fail actions, 2 corrective actions, and part numbers are in ServiceForge. Connect ServiceForge to your AI

Memory test failures during diagnostic

Memory diagnostic tests report errors at multiple address ranges during PIPE & 68000 to DATA MEMORY TEST execution

Ranked causes

  1. 1. Defective data memory module or address range (unknown)
  2. 2. DMA controller malfunction (unknown)
First check

Execute full memory diagnostic with DMA testing

Test point
PICKER ARRAY PROCESSOR PIPE-DATA MEMORY DIAGNOSTIC menu
Expected
All memory tests at ranges 9d180, 9e100, 9f080, 81000, 81f80, 82f00, 83e80, 84e00, 9a300, 9b280, 9c200, 9d180, 9e100, 9f080 complete without errors

1 more check with pass and fail actions, 2 corrective actions, and part numbers are in ServiceForge. Connect ServiceForge to your AI

Patient support brake does not stop immediately patient safety

Vertical motion continues when gantry control switches are released; brake makes excessive noise or fails to arrest motion

Ranked causes

  1. 1. Brake hub not properly aligned (common)
  2. 2. Brake wiring connections loose or faulty (common)
First check

Raise patient support a few centimeters using gantry control panel

Test point
Gantry control panel switches
Expected
Patient support rises smoothly

1 more check with pass and fail actions, 2 corrective actions, and part numbers are in ServiceForge. Connect ServiceForge to your AI

Patient support does not raise or lower smoothly patient safety

Scissor mechanism binds or moves erratically during height adjustment via gantry control panel

Ranked causes

  1. 1. Vertical support brace misaligned or not properly positioned (occasional)
  2. 2. Ballscrew damaged from carriage collision (rare)
First check

Verify vertical support brace position and clearance

Test point
Green safety vertical support brace on scissor carriage
Expected
Brace installed per Figure 38 with scissor carriage stopping just before touching brace

2 corrective actions and part numbers are in ServiceForge. Connect ServiceForge to your AI

Patient support does not stop immediately patient safety

Vertical motion continues after control switches are released; brake fails to halt descent

Ranked causes

  1. 1. Brake hub not properly aligned (common)
  2. 2. Wiring connections loose or incorrect (occasional)
First check

Brake operational response to control input

Test point
Gantry control panel switches
Expected
Vertical motion stops immediately when switches are released

2 more checks with pass and fail actions, 2 corrective actions, and part numbers are in ServiceForge. Connect ServiceForge to your AI

Patient support does not stop immediately when brake control released patient safety

Vertical motion continues after operator releases gantry control panel switches; brake does not halt patient support promptly

Ranked causes

  1. 1. Brake hub not properly aligned (common)
  2. 2. Brake wiring connections loose or faulty (occasional)
First check

Operate patient support vertical motion using gantry control panel switches

Test point
Gantry control panel switches
Expected
Vertical motion stops immediately when switches are released

1 more check with pass and fail actions, 2 corrective actions, and part numbers are in ServiceForge. Connect ServiceForge to your AI

Patient support does not stop immediately when brake is released patient safety

Vertical motion continues after gantry control switches are released; brake may make excessive chattering noise

Ranked causes

  1. 1. Brake wiring connections loose or disconnected (common)
  2. 2. Brake hub not properly aligned (common)
First check

Operate patient support vertical motion using gantry control panel

Test point
gantry control panel switches
Expected
vertical motion stops immediately when switches are released

2 corrective actions and part numbers are in ServiceForge. Connect ServiceForge to your AI

Patient support does not stop immediately when brake switches released patient safety

Vertical motion continues after operator releases gantry control panel switches; brake fails to halt patient support

Ranked causes

  1. 1. Brake hub not properly aligned (common)
  2. 2. Brake wiring connections loose or disconnected (common)
First check

Raise patient support a few centimeters using gantry control panel

Test point
Gantry control panel switches
Expected
Patient support rises smoothly

2 more checks with pass and fail actions, 2 corrective actions, and part numbers are in ServiceForge. Connect ServiceForge to your AI

Remove inverter diagnostic board CRX-200 high voltage

Procedure to remove and replace inverter diagnostic board; requires 50 minutes and involves high voltage safety precautions

Ranked causes

  1. 1. Inverter diagnostic board requires service or replacement (unknown)
  2. 2. Reassemble gantry and restore power (unknown)
First check

De-energize gantry at wallbox

Test point
External power wallbox
Expected
Gantry power off; five-minute wait for rail voltage discharge

2 more checks with pass and fail actions, 5 corrective actions, and part numbers are in ServiceForge. Connect ServiceForge to your AI

Replace XSC+ PCB caution

Removal and installation of XSC+ printed circuit board during repair procedures

Ranked causes

  1. 1. XSC+ PCB requires replacement (unknown)
  2. 2. Scan frame positioning after PCB replacement (unknown)

4 corrective actions and part numbers are in ServiceForge. Connect ServiceForge to your AI

More symptoms

  • Scan control panel not responding
  • Slip ring misalignment detected during calibration
  • SMADD diagnostic displays error during small drives test
  • Unswitched Voltage Indicator not lit
  • 8 mm tape drive replacement
  • 8mm tape drive replacement
  • AC input chassis replacement
  • Access Error Reporting Program for troubleshooting
  • Accidental contact with exposed high voltage
  • Actual Length of Exposure (ALE) fault
  • Address counter overrun
  • Address counter underflow
  • Air bubbles in water phantom
  • Anode high voltage module removal and replacement
  • Anode HV module handling safety
  • Anode multiplier handling hazard
  • Anode multiplier removal required
  • Anode multiplier weight and handling hazard
  • Anode/Cathode Arc detection during exposure
  • Array processor data memory crosstalk suspected
  • Audible knocking detected during vertical patient support movement
  • Audible knocking detected in vertical patient support movement
  • Audible knocking in vertical patient support movement
  • Background zero test - excessive coherent noise detected
  • Backprojector memory diagnostic test execution
  • Ballscrew damage from carriage contact
  • Ballscrew damage from scissor carriage contact
  • Ballscrew drive damage from lowering support with brace installed
  • Ballscrew drive damage from patient support lowering with vertical support brace installed
  • Ballscrew drive damage from vertical support brace not removed
  • Ballscrew drive damage risk from vertical support brace
  • Ballscrew misalignment from carriage-brace contact
  • Ballscrew misalignment from scissor carriage collision
  • Ballscrew removal and replacement
  • Beam limiter does not cycle on/off
  • Beam Limiter Solenoid calibration
  • Bearing – carbon top defective
  • Belt tension adjustment
  • Blower not operating
  • Blower not operating after replacement
  • Blower replacement
  • Brake cable disconnect
  • Brake cable replacement procedure
  • Brake makes excessive noise
  • Cable obstruction in frame travel range
  • Calibration after front-end repair
  • Calibration files not updating
  • Calibration: -15V power supply
  • Calibration: -18V A-B power supply
  • Calibration: -18V A-B power supply PS204
  • Calibration: –15 VDC power supply adjustment
  • Calibration: –15 VDC power supply verification
  • Calibration: –15 Volt adjustment
  • Calibration: –15 Volt DC Power Supply
  • Calibration: –20 VDC power supply verification
  • Calibration: +15 VDC output adjustment
  • Calibration: +15 VDC power supply verification
  • Calibration: +15 volt DC power supply
  • Calibration: +15V power supply
  • Calibration: +18V A-A and -18V A-A power supplies
  • Calibration: +18V A-A power supply
  • Calibration: +18V A-A power supply PS202
  • Calibration: +18V A-B power supply
  • Calibration: +18V A-B power supply PS203
  • Calibration: +20 VDC power supply verification
  • Calibration: +5, +15, –15, +20 and –20 VDC power supply verification
  • Calibration: +5, ±15 volt DC power supply
  • Calibration: +5, ±15, ±20 Volt DC power supply verification
  • Calibration: 12 o'clock laser alignment
  • Calibration: 7-inch X-ray tube mounting rails installation
  • Calibration: 7" tube system installation and alignment
  • Calibration: AC control panel startup and power supply voltage adjustment
  • Calibration: Adjust vertical travel limit switches
  • Calibration: Air calibration after detector module or VFSCC replacement
  • Calibration: Air calibration file interpolation
  • Calibration: Air calibration for PQ protocols
  • Calibration: Air calibration half field and full field
  • Calibration: Aircal interpolation
  • Calibration: Anode multiplier replacement post-service
  • Calibration: Apply threadlocker to mounting screws
  • Calibration: ARDAS detector verification
  • Calibration: Axial alignment block pivot positioning
  • Calibration: Ballscrew greasing and motor alignment
  • Calibration: beam limiter solenoid
  • Calibration: Beam limiter solenoid actuator extension
  • Calibration: Beam Limiter Solenoid alignment
  • Calibration: Beam limiter solenoid extension
  • Calibration: Beam pivoting adjustment
  • Calibration: Brush block alignment
  • Calibration: Brush block radial alignment
  • Calibration: Cathode multiplier replacement
  • Calibration: Center program execution
  • Calibration: Collimator alignment verification
  • Calibration: Collimator eccentric alignment
  • Calibration: Collimator opening alignment
  • Calibration: Console air filter direction verification
  • Calibration: Couch drive belt pulley alignment
  • Calibration: Couch horizontal drive belt tension
  • Calibration: Custom calibration
  • Calibration: DC power supply verification
  • Calibration: Drive verification
  • Calibration: Electronic centering
  • Calibration: Field detector module evaluation
  • Calibration: Fine RDC Zero Adjustment
  • Calibration: Fine zero adjustment
  • Calibration: FLATSS manual flat field correction
  • Calibration: FLATSS manual flatfield correction
  • Calibration: FLATSS verification
  • Calibration: Full Field FLATSS
  • Calibration: Gantry cover and scan drive procedures
  • Calibration: Gantry tilt drive
  • Calibration: Gantry tilt potentiometer and pulley replacement
  • Calibration: Half field flats
  • Calibration: Half Field FLATSS
  • Calibration: Horizontal timing belt replacement
  • Calibration: Laser alignment
  • Calibration: Laser alignment for scan frame
  • Calibration: Laser beam crosshairs verification
  • Calibration: Lateral centering
  • Calibration: LRDC Gantry power supply
  • Calibration: Lump correction
  • Calibration: mA curve
  • Calibration: Main drive excitation level
  • Calibration: Main drive excitation level adjustment
  • Calibration: Manual FLATSS
  • Calibration: Manual FLATSS for X-ray imaging
  • Calibration: Patient Support horizontal centering
  • Calibration: Patient support table limit switches
  • Calibration: Patient Support table position limits
  • Calibration: Patient support vertical positioning
  • Calibration: Patient Support vertical travel limit switches
  • Calibration: Pilot
  • Calibration: Pilot Field
  • Calibration: Poly-Sci signal brush block alignment
  • Calibration: Power supply outputs
  • Calibration: PQ image centering and tube heat
  • Calibration: pre-calculated FLATSS verification
  • Calibration: Preheat table parameters OL 9 & 10
  • Calibration: Preheat values for filament
  • Calibration: Resolver error correction circuitry
  • Calibration: Scan frame alignment with tube at 12:00
  • Calibration: Scan frame laser alignment
  • Calibration: servo-controller fan mounting hardware replacement
  • Calibration: Shutter operation
  • Calibration: Sine wave verification
  • Calibration: Site configuration parameter adjustment
  • Calibration: Standard Calibration
  • Calibration: Standard Performance
  • Calibration: Standard performance evaluation
  • Calibration: System image alignment and constants
  • Calibration: System image calibration
  • Calibration: System monitor PCB verification
  • Calibration: System prerequisites and setup verification
  • Calibration: Table top limit switch adjustment
  • Calibration: Table top limit switches
  • Calibration: Vertical brake installation
  • Calibration: Vertical brake removal and replacement
  • Calibration: Vertical scale potentiometer
  • Calibration: Vertical travel limit switch adjustment
  • Calibration: X-ray beam centering
  • Calibration: X-ray tube alignment
  • Calibration: X-ray tube alignment prerequisite
  • Calibration: X-ray tube axial adjustment
  • Calibration: X-ray tube change
  • Calibration: X-ray tube mechanical alignment
  • Calibration: X-ray tube mounting rail installation
  • Cannot open database
  • Carbon patient support damage from heavy tube placement
  • Carbon top bearing replacement required
  • Carbon top removal and replacement
  • Cardfile circuit board removal and replacement
  • Cathode high voltage module replacement
  • Cathode multiplier removal requires high voltage discharge time
  • Cathode multiplier replacement on CRX-200/CRX-400
  • Cathode multiplier replacement procedure
  • Cathode multiplier weight hazard during handling
  • Check for loose cables and frame clearance
  • Collimator alignment verification
  • Collimator assembly installation verification
  • Collimator diagnostic test
  • Compensator diagnostic test
  • Console air filter needs replacement
  • Console air filter replacement
  • Console cardfile PCB requires removal or replacement
  • Control word write/read mismatch
  • Corrupt pilot scan data
  • Couch clearance during diagnostic motion
  • Couch drive velocity measurement needed
  • Couch drive velocity measurement test
  • Couch horizontal drive belt tension adjustment
  • Couch movement during diagnostic
  • Couch moves unexpectedly during diagnostic test
  • Couch position measurement verification
  • Couch velocity measurement check
  • Couch velocity measurement needed
  • Could not get Nth msg from CALF
  • Cradle assembly improper seating on 7-inch tube
  • Cradle assembly installation on 7-inch tube
  • Cradle mounting screws improperly torqued
  • DAC calibration with standard vs. touched-up state
  • Dangerous high voltage exposure with gantry covers removed
  • Dangerous voltage exposure during gantry cover removal
  • Dangerous voltage exposure during maintenance
  • Dangerous voltage exposure during service
  • Dangerous voltage exposure from removed gantry covers
  • Dangerous voltage exposure with covers removed
  • Dangerous voltage exposure with gantry covers removed
  • Dangerous voltages exposed with covers removed
  • Dark spot visible in air scan after calibration
  • Data acquisition overrun
  • Data file English 00-7 missing
  • Database already opened by same task
  • Database navigation past boundary
  • Database record update failed
  • DC power supply voltages out of range
  • Detector center ray position incorrect
  • Detector module select line voltage abnormal
  • Detector number out of range in predata word
  • DIP switch configuration error
  • Disable stand-alone gantry control and restore normal operation
  • Discharge high voltage before cathode multiplier work
  • DITS counter not reset by MSML
  • DITS counter reads incorrect value
  • Divide by zero error in plot file
  • Divide by zero error, plot file not updated
  • Drive belt pulley alignment verification
  • Drive belt rides off-center on pulley
  • E/L Touch Panel not responding
  • EL touch panel inoperative or unresponsive
  • EL touch panel operation verification
  • EL touch panel physical damage or loose mounting
  • EL touch panel removal and replacement
  • EL touch panel replacement
  • EL touch panel requires replacement
  • Electrostatic discharge (ESD) hazard during PCB work
  • Electrostatic discharge protection during PCB work
  • EMI shield removal (CRX-400)
  • Equipment damage or serious injury from exposed high voltage
  • Error on alert board during pre-scan test
  • Error opening /dev/avoice
  • Error opening /dev/avoice – Device file missing
  • Error opening tty
  • Error opening tty – Fatal error
  • Error reading calibration parameters
  • Error reading scan data
  • Error reading scan data – couch did not reach endpoint
  • Excessive couch displacement during diagnostic
  • Exposed high voltage hazard during gantry access
  • Exposed high voltages during gantry cover access
  • Exposure to dangerous voltages during gantry cover removal
  • File not found or unreadable
  • File NOT in database for parameters
  • FLATSS protocol configuration
  • Front cone misalignment after replacement
  • Gantry air blower replacement needed
  • Gantry air blower replacement required
  • Gantry air blower requires replacement
  • Gantry and couch motion via IQOUT diagnostic tool
  • Gantry cover replacement and system verification
  • Gantry covers opened for service
  • Gantry covers removal hazard awareness
  • Gantry electronics do not power on
  • Gantry front cover not installed
  • Gantry home position rotation hazard
  • Gantry overheating due to inadequate blower cooling
  • Gantry power not available
  • Gantry power-on procedure
  • Gantry requires independent power control for service
  • Gantry rotation hazard during laser button press
  • Gantry scan frame rotation check
  • Gantry scan frame rotation hazard
  • Gantry speaker phrase not audible
  • Gantry tilt motion during scan
  • Gantry tilt potentiometer replacement needed
  • Glass top breakage during handling
  • Gull wing panels sharp edge hazard
  • Half Field FLATSS calibration
  • Hard drive replacement
  • Heavy anode multiplier handling hazard
  • High voltage bus exceeds 400 VDC
  • High voltage discharge safety hazard during multiplier removal
  • High voltage exposure during cover removal
  • High voltage exposure during gantry cover removal
  • High voltage exposure during gantry service
  • High voltage exposure during open-cover operation
  • High voltage exposure during service
  • High voltage exposure hazard awareness
  • High voltage exposure hazard during gantry cover removal
  • High voltage exposure hazard during power supply verification
  • High voltage exposure with covers removed
  • High voltage exposure with gantry covers removed
  • High voltage generator control board replacement
  • High voltage module service with covers removed
  • High voltage present after power removal
  • High voltage present on gantry terminal block after interlock
  • High voltage present on Spellman cable after power removal
  • High voltage present on transformer connections and Spellman cable
  • HIGH_VOLTAGE hazard during gantry maintenance
  • Horizontal timing belt worn or damaged
  • HVG generator errors
  • HVGCC component replacement
  • Illegal kV Fault
  • Illegal signal detected
  • Improper circuit board handling causing permanent component damage
  • Improper exit error when Control-C pressed
  • Intercom audio not audible
  • Intercom calibration verification
  • Intercom speaker or microphone does not operate
  • Intercom system not functioning
  • Interference limit reached
  • Intermittent memory errors detected during diagnostics
  • Invalid or no parameter in optable field
  • Invalid SCAREMAN/SCAN state
  • Laser alignment verification required
  • Laser alignment verification with phantom
  • Laser cone replacement
  • Lasers not illuminating inside gantry
  • Logic ground verification
  • Loose cables detected during frame rotation
  • Loose cables in scan frame
  • Loose cables or contact during frame rotation
  • lread of speech data error
  • lread of speech header error
  • lseek past data header error
  • Memory diagnostic test execution
  • Memory test execution time monitoring
  • Missed EOF at specified register value
  • Missed PPI at specified register value
  • Motor and ballscrew couplings disengaged
  • Motor drive phase misalignment after pole offset adjustment
  • Multibus II backplane replacement
  • Multibus II backplane replacement verification
  • No Exposure error condition
  • Opening upper gantry covers
  • Operator Console does not turn on
  • Operator's Console powered down unexpectedly during service
  • Over-current condition on high voltage bus
  • Patient support collapse risk during maintenance
  • Patient support covers open—high voltage exposure
  • Patient support does not lower smoothly
  • Patient support falls uncontrolled when vertical motor removed
  • Patient support lowers with vertical brace in place
  • Patient support telescoping base cover removal preparation
  • Patient support telescoping base covers removed
  • Patient support uncontrolled descent during vertical motor removal
  • Patient support will not lower properly
  • Phrase not proper during verbal memory test
  • Physical call error
  • Physical call error – Fatal error
  • Pilot mask bit set for CT scan
  • Pilot scan image artifacts or errors
  • Post-calibration board replacement and cover restoration
  • Power supply voltage out of range
  • Power supply voltage out of specification
  • Power supply voltages out of range
  • PPI occurred early or no data taken
  • PPI stuck active or EOF stuck active
  • Pre-data word 4 grabber mismatch
  • Register load error
  • Remove and replace high voltage generator control boards
  • Remove anode high voltage module
  • Replace 1.1 KVA auxiliary transformer
  • Replace AC control chassis circuit board
  • Replace anode high voltage module
  • Replace beam limiter solenoid assembly
  • Replace gantry cardfile circuit board
  • Replace gantry microphone PCB
  • Replace patient support carbon top
  • Replace servo-controller fan
  • Replace system control board
  • Residual voltage on high voltage bus after de-energization
  • Risk of radiation exposure during IQOUT operation
  • Risk of serious injury during gantry or couch motion
  • Rotate scan frame to 12:00 position
  • Rotating gantry frame hazard during equipment operation
  • Scan drive does not rotate smoothly or rotates backwards
  • Scan drive not rotating smoothly or rotating backwards
  • Scan frame cable inspection and clearance check
  • Scan frame damage from clockwise rotation
  • Scan frame rotated clockwise
  • Scan frame rotates incorrectly or slip ring brushes damaged
  • Scan frame rotation and cable inspection
  • Scan frame rotation causes slip ring brush damage
  • Scan frame rotation causes slip ring brush damage
  • Scan frame rotation check
  • Scan frame rotation check
  • Scan frame rotation check after HV module replacement
  • Scan frame rotation check after service
  • Scan frame rotation check and cable inspection
  • Scan frame rotation damage risk
  • Scan frame rotation damage to slip ring brushes
  • Scan frame rotation damaged slip ring brushes
  • Scan frame rotation damages slip ring brushes
  • Scan frame rotation inspection
  • Scan frame rotation resistance or damage
  • Scan frame slip ring brush damage during rotation
  • Scissor carriage lowering procedure
  • Scissor carriage misalignment after service
  • Scissor mechanism entrapment hazard
  • Scissor-action mechanism exposed during base cover removal
  • Scissor-action mechanism exposed during patient support base cover removal
  • Scissor-action mechanism exposure hazard
  • Scissor-action mechanism exposure risk
  • Scissor-action mechanism hazard during service
  • Scissor-action mechanism injury risk
  • Scissors carriage collision with vertical support brace
  • Sequence error detection
  • Sequence interrupted during image save
  • Sequence interrupted during processing
  • Servo-controller fan installation
  • Servo-controller fan removal and replacement
  • Servo-controller fan replacement
  • Servo-controller fan replacement needed
  • Servo-controller fan replacement required
  • Servo-controller fan requires replacement
  • Setup for console power supply calibration
  • Sharp edge and electrical hazard during gantry cover removal
  • Sharp edge hazard from upper gull wing panels
  • Sharp edges on gull wing panels during gantry cover service
  • Shutter binding during beam limiter activation
  • Shutter binding during installation
  • Shutter binding in beam limiter
  • Shutter binding on 7" tube system
  • Slip ring brush damage during scan frame rotation
  • Slip ring brush damage during scan frame rotation
  • Slip ring brush damage from improper scan frame rotation
  • Slip ring brush damage risk during service
  • Slip ring brushes damaged by scan frame rotation
  • Slip ring brushes damaged during scan frame rotation
  • Slip ring power absent or low
  • Solenoid clamping screw torque
  • SPEAK CONSOLE address low response error
  • Specific memory area or function test selection
  • Startup Options menu not displayed
  • Static damage to circuit boards during handling
  • Static electricity hazard during circuit handling
  • Static electricity protection during circuit board handling
  • System does not display Startup Options menu
  • System does not power on
  • System does not power on after blower replacement
  • System does not power up normally
  • System generates X-rays unexpectedly via IQOUT
  • System image quality verification after blower replacement
  • System monitor PCB failure or malfunction
  • System monitor PCB not functioning
  • System monitor PCB not working
  • System monitor PCB not working or boot failure
  • System monitor PCB replacement
  • System monitor PCB replacement required
  • System monitor PCB verification
  • System not warmed up before clinical use
  • System operation not verified after assembly
  • System operation not verified with phantom images
  • System operation verification after collimator replacement
  • System startup incomplete or bootstrap failed
  • System verification after transformer replacement
  • System verification with water phantom scan
  • System will not boot
  • System will not power on after blower replacement
  • Tape drive requires removal and repair
  • Tape switch foot actuator defective
  • Tape switch foot not responding
  • Task priority not set
  • Task priority not set – Fatal error
  • Timed out waiting for calibration agents
  • Timing belt tension check
  • Too many points out of range
  • Tools preparation
  • Tube cradle orientation incorrect
  • Tube type mismatch before gantry power-up
  • Tube type mismatch detected
  • Tube type mismatch on power-up
  • Unable to attach to CALF Message Queue
  • Unable to send message to exchange
  • Unable to write image data to file
  • Unintended gantry or couch motion via IQOUT
  • Unintended X-ray generation during IQOUT operation
  • Unit does not boot after system monitor PCB replacement
  • Unit stops at C message during bootstrap
  • Verification: Full-field flats uniformity
  • Vertical brake removal and replacement needed
  • Vertical couch motion during scan
  • Vertical drive mechanism misalignment
  • Vertical motor mounting plate screws loose or improper gap
  • Vertical motor not responding to gantry control panel commands
  • Vertical patient support collapses or motor coupling disengages
  • Vertical position display does not decrease during patient support lowering
  • Vertical support brace cable exposed or damaged
  • Vertical support brace cable not properly positioned
  • Vertical support brace installation
  • Vertical support brace misalignment after scissor carriage operation
  • Voltage rail out of specification
  • Warmup and ELTP operation not completed
  • Warmup cycle errors
  • Write error to plot.dat file
  • Write error to raw data file
  • X-ray control chassis removal and replacement
  • X-ray control chassis removal hazard
  • X-ray generation via IQOUT diagnostic tool
  • X-Ray Generator does not power on
  • X-ray tube base plate removal
  • X-ray tube damage during high voltage connector removal
  • X-ray tube mechanical alignment after solenoid replacement
  • X-ray tube mechanical misalignment
  • X-ray tube removal procedure
  • X-ray tube replacement
  • X-ray tube replacement procedure
  • X-ray tube shutter binding
  • Z-beam tube orientation during installation

509 more symptoms with ranked causes and checks are in ServiceForge. Connect ServiceForge to your AI

Error codes

CodeMeaningTriggerSeverity
0New Installation?, Creating Configuration fileFirst startup or configuration file initializationinfo
1Unable to create message exchange of DBIXSystem initialization or inter-process communication setuperror
10Unable to get status & id of process '!!se'Query of process status failswarning
100Regulus server attachment failureUnable to connect to Regulus servererror
100Error attaching to Queue IM2SArchiver cannot attach to message queue IM2Serror
100Attempting to update a record when there is no current record activeNo current record active during update attempterror
100Unable to get regulus serverServer initialization or connection attemptcritical
1001XSC+ BAD XSC-TIMER DRIVER: INVALID DATAScan error occurs during XSC+ operationerror
1001Miscellaneous XSC errors including timer driver, command, state, tube type, collimator, filter and compensator issuesXSC timer driver message error, invalid command/data/access, bad host command, improper status request, wrong XSC state for exposure, illegal tube type request, component not ready for X-rayserror
1001Miscellaneous errorsXSC timer driver failures, host command issues, tube type or generator changes not in idle state, or readiness failures for collimator, filter, or compensatorerror
1001-1100XSC error rangeVarious XSC (X-ray System Control) subsystem failureserror
1002High voltage interface driver errorsMessage exchange failures with ADC/DAC/HVST/HVCT, DAC initialization error, tolerance violations, incorrect commands, or ADC conversion timeouterror
1003Anode Rotor Soft failureAnode Rotor Soft component malfunctionunknown
1004Small Drives subsystem failureSmall Drives component malfunctionunknown
100 (dirp)Unable to get Regulus server gsvrRegulus server lookup failserror
101Regulus server release failureUnable to release Regulus server connectionerror
101Navigation past database or study boundaryMoving past beginning of CL and database or studywarning
101Unable to return/release Regulus server resourceClient releasing server resource after useerror
1010Anode Rotor Hard failureAnode Rotor Hard component malfunctionunknown
1011HVPSI high voltage power supply failureHVPSI component malfunction or regulation failureunknown
1013XSC subsystem failureXSC component malfunction or communication errorunknown
101 (dirp)Unable to return/release Regulus server retsvrServer release call failserror
102Cannot receive query request from resource manager queueSystem communication failure with resource managererror
102OPDS queue errorSystem message from Reguluserror
102Cannot receive on queue; error code <serror>Attempt to receive message from specified queueerror
102SMB frame manager cannot receive on OPCMFailed SMB reception during frame processingerror
102Cannot receive message from Resource Manager or cannot receive message from ResourceResource Manager communication failure during config or imgspace operationserror
102Regulus queue message receive failureUnable to receive message from Regulus queueerror
102Error doing a msgrcv()Message receive operation failederror
102Could not open databaseAttempt to open databaseerror
102 (dbtb)Unable to receive message from IRTB_MSGMessage queue communication timeouterror
102 (didb)Unable to receive message from DIDB_MSGMessage queue communication timeouterror
102 (dirp)Unable to receive message from Regulus queueMessage queue receive timeouterror
103SMB frame manager cannot send on RENNFailed SMB transmission during frame processingerror
103Cannot send on queue; error code <serror>Attempt to send message on specified queueerror
103Unable to send a message to Regulus queue for image transferMessage send failure to image transfer queueerror
103Error doing a msgsnd()Message send operation failederror
103 (dbtb)Unable to send message to DBTB_MSGMessage queue communication timeouterror
103 (dirp)Unable to send message to Regulus queue msgsndMessage queue send failserror
104Cannot get module ID for OPCM or RT4ANModule identification query failureerror
104Cannot create temporary queue or cannot obtain resource manager qid or cannot remove temporary queueQueue creation, removal, or resource manager ID retrieval failserror
104OPDS or opcm errorSystem message from Reguluserror
104SCANMAN cannot attach to LOAD queueFailed to attach to LOAD message queueerror
104Unable to get message queue id of DBIR_MSGQueue identifier lookup during initializationerror
104 (dbtb)Unable to get message queue id of DBTB_MSG or IRTB_MSGMessage queue lookup failureerror
104 (didb)Unable to get message queue id of DIDB_MSGMessage queue lookup failureerror
104 (dirp)Unable to get Regulus message queue dirpkeyQueue ID lookup failserror
105Error opening log fileCannot open log file for writingwarning
105SCANMAN could not open fileFile open operation failederror
105Cannot find or open $CAM/menu/cameras configuration fileCamera configuration file missing or inaccessible at startuperror
105Phrase file error with status codeError reading status from load operationerror
105File system errorFile operation failureerror
105Unable to open file in RegulusFile open operation failederror
107Unable to read from file in RegulusRead request to Regulus file servererror
107Error reading status from load with status codeLoad operation status read failserror
107Cannot seek in config.tbl file or cannot read device or cannot read config.tbl data saveFile seek operation fails or device read fails or config.tbl unreadable during save operationserror
107File system errorFile operation failureerror
107Error opening log fileCannot open log file for writingwarning
107Can not read file (x)File read operation fails on deviceerror
107Software upgrade in progress or configuration being recreatedSystem is performing software upgrade or recovering configurationinfo
108Cannot write config.tbl; scanning may fail or data save NOT ENABLED or NOT DISABLEDWrite operation to config.tbl fails during configuration or save operationserror
108Unable to write to file in RegulusWrite request to Regulus file servererror
109Cannot seek in config.tbl file during save operationsFile seek fails in config.tbl during saveoff/saveonerror
11Task deletion failureUnable to delete task on shutdown or cleanupwarning
11Unable to delete task CROSTask deletion attempt during shutdown or reseterror
111SCANMAN processor reboot requiredSpecified processor requires rebootwarning
112SCANMAN load file errorFailed to load specified file to processorerror
114SCANMAN could not write parameter table to processorFailed to write DISPLAY or SCAN parameter table to specified sloterror
116Not enough EB's or backprojector disabled; cycle time will be increasedwarning
116Cannot find board or no responseBoard communication failurecritical
116Insufficient event buffers availableSystem runs out of available event buffers during operationwarning
116Module or board not found or no response from boardModule discovery failure or timeout during pollingerror
117SCANMAN miscellaneous file I/O errorerror
11-rtvuUnable to delete task HAIRChild process deletion failurecritical
12Unable to suspend task EXPOSystem cannot pause or suspend EXPO taskerror
1202CALM error (CALM_ERR) – internal structures of CALM and/or memory on the MPM gets corruptedCALM does not know what to do in error situationerror
1203CALF error (CALF_ERR) – calfmr on the MPM (CALM) cannot communicate with calfmr on the CPB (CALF)Communication failure between CALM and CALFerror
125Attempting to open database when one is already opened by same taskSecond database open request while one already activeerror
1501SC_LIBRARY_ERRORError detected in Scheduler library function callerror
1502SC_PROCESS_REQUEST_ERRORProcessor portion of Reconstruction Software senses error or times outerror
1502Processor portion of Reconstruction Software sensed an error or timed outError or timeout during image reconstruction processingerror
1503Error or timeout occurred while saving reconstructed image to diskFailure during image save operation to diskerror
1503SC_IMAGE_SAVE_ERRORError or timeout while saving reconstructed image to diskerror
1504Illegally formatted message received by SchedulerMalformed message received by Schedulererror
1504SC_ILLEGAL_MESSAGEIllegally formatted message received by Schedulererror
1505Unexpected message received or general message reception failureUnexpected message arrival or failure in message receptionwarning
1505SC_GET_EVENT_FAILUREUnexpected message received or general message reception failureerror
1506SC_SLICE_Q_MSGSNDError in sending Slice Query response message to OPCOMerror
1506Error in sending Slice Query response message to OPCOMFailure to send Slice Query response to OPCOMerror
1507Failure or timeout in use of calibration informationAttempt to access or apply calibration data failederror
1507SC_CALIB_USE_FAILFailure or timeout in attempt to make use of calibration informationerror
1508Failure or timeout in attempt to use weighing vectors for spiral scanningWeighing vector access or processing timeout during spiral scanerror
1508SC_WT_USE_FAILFailure or timeout in attempt to make use of weighing vectors for spiral scanningerror
1509SC_LINK_BUFFERS_FAILUREFailure to link optable and data buffer togethererror
1509Failure to link optable and data buffer togetherBuffer linking operation failed during processing setuperror
151Cannot remove temporary queueTemporary queue cleanup fails after operation completewarning
151SCANMAN message queue error (create, read status, size, flush, send, timeout)error
1510SC_UPDATE_FAILUREFailure in slice number update of previous processing requesterror
1510Failure in slice number update of previous processing requestSlice numbering update operation failederror
1511Failure in the stop reconstruction procedureStop reconstruction procedure invokederror
1512Failure in the Suspend Processing procedureSuspend processing invokederror
1513Failure in the Resume Processing procedureResume processing invokederror
1514Failure in the process scheduling procedureProcess scheduling attemptederror
1515Failure in the clear processing procedureClear processing invokederror
1516Failure in the Error reporting communication channel to SCAREMANError reporting attempt to SCAREMANwarning
1517Failure in the Processing Done procedureProcessing Done notification invokederror
1518Failure in the Processor Registration procedureProcessor Registration procedure invokederror
1519Failure in the Slice number querying procedureSlice number query requested by OPCOM or SCAREMANerror
1520Failure in the Control Status Query ProcedureControl status query requested by OPCOMerror
1521Failure in the Calibration Use Acknowledgement procedureDuring calibration use acknowledgement sequenceerror
1522Failure in the Weighing Vector Acknowledge procedureDuring weighing vector acknowledgementerror
1523Failure in the changing of Control ModesDuring control mode change, possibly during calibrationerror
1524Failure in the data input proceduresDuring data reception tracking or scan error monitoringerror
1525Failure in phase 1 of Scheduler initializationDuring initial scheduler startup phase 1error
1526Failure in phase 2 of Scheduler initializationDuring scheduler startup phase 2error
1527Failure in the resource manager interface procedureWhen resource manager attempts to communicate with schedulererror
1528Failure in the scheduler debug proceduresDuring scheduler debug operationwarning
1529General mode failure in SchedulerScheduler mode operation errorerror
153Command read from pipe failedAttempt to read process command from inter-process communication pipeerror
1530General initialization failureDuring scheduler initializationcritical
154Acknowledgment or negative acknowledgment write to pipe failedAttempt to send response via pipeerror
154SCANMAN error writing pipeerror
154LSTY errorSystem component failureerror
1540Memory Manager release error.Memory Manager unable to release allocated memorywarning
1541Internal table overflow.Internal data table exceeds maximum capacityerror
1542Optable handle not found.Referenced handle does not exist in Optableerror
1543Invalid incoming event message.Received event message is invalid or unrecognizedwarning
155Pipe close operation failedAttempt to close pipe read or write endwarning
1551Extraction of parameter from optable failed.Optable Manager attempts to extract parameter from optable buffererror
1552Error in OPCOM interface.Optable Manager interfaces with OPCOM subsystemerror
1553Error in OPCOM interface.Optable Manager queries OPCOM for operation done statuserror
1554Error in creation of Optable.Optable Manager attempts to create new optableerror
1555Initialization failure.Optable Manager initialization sequenceerror
1556Invalid or illegal event message.Optable Manager receives event message from systemwarning
1557Memory allocation failure.Optable Manager attempts to allocate memory for operationcritical
1558Error in cancel by DAQMN.Data Acquisition Manager (DAQMN) attempts to cancel operation in Optableerror
1559Error in freeing of optable memory.Optable Manager attempts to free allocated optable memoryerror
156Unable to fork process rdbiSystem process creation failurecritical
1560Failure in optable retrieval by OPCOMoptable retrieval processerror
1561Failure in optable retrieval by OPCOM with 2-ACK protocol2-ACK optable retrieval attempterror
1562Error in debug proceduredebug procedure executionwarning
1563Fill optable manager table failureoptable manager fill operationerror
1564Failure in optable usage by SchedulerScheduler attempting to use optableerror
1565Optable Create failureoptable creation operationerror
1566Optable deuse failureoptable deuse operationwarning
1567Failure in deallocation of Optableoptable deallocation operationerror
1568Failure in update of optable informationoptable update operationerror
1569Failure in phase 1 of initializationOptable initialization phase 1 executederror
157rtroff error with serror codertroff operation in /usr/IQ/bin/serv/ failserror
157Cannot spawn taskTask creation failureerror
1570Failure in phase 2 of initialization.Initialization phase 2 encounters error conditionerror
1571Failure in memory allocationWhen system attempts to allocate memoryerror
1572Illegal message format.Received message does not conform to protocol specificationwarning
1573Inconsistent Acknowledgement tag receivedDuring message acknowledgement handshakeerror
1574Error in Memory Manager interface.Memory Manager interface operation failserror
1575Memory Manager lock errorWhen Memory Manager attempts to lock resourceserror
1583DITA or AutoCAL interface errorDITA or AutoCAL interface malfunctionerror
1583DM_PIPP_END_ERRORDITA or AutoCAL interface errorerror
1584DITA or AutoCAL interface errorDITA or AutoCAL interface malfunctionerror
1584DM_PIPP_CREATE_ERRORDITA or AutoCAL interface errorerror
1585DM_PIPP_HBEAT_ERRORDITA or AutoCAL interface errorerror
1585DITA or AutoCAL interface errorDITA or AutoCAL interface malfunctionerror
1586Memory manager lock errorMemory manager unable to acquire lock on memory resourcecritical
1587DM_BAD_ALLOACK_STATUSMemory allocation errorerror
1587Memory allocation errorSystem unable to allocate requested memoryerror
1588DM_BAD_ALLOFIX_ACK_STATUSFixed memory allocation errorerror
1588Fixed memory allocation errorSystem unable to allocate fixed memory blockerror
1589DM_HANDLE_NOT_FOUNDBuffer handle lookup failureerror
1589Buffer handle errorInvalid or unavailable buffer handle referencederror
1590Optable interface lock failedUnable to acquire lock on Optable interface resourceerror
1591Optable get failureOptable unable to retrieve requested dataerror
1592Internal Data Manager table overflowData Manager internal table exceeded capacitywarning
16Unable to allocate memory segment setdsphwerror
160Key value changed unexpectedlyDatabase key value mismatch detectederror
161Signal opcom errorInter-process communication failureerror
162SCANMAN could not allocate full image backup fileerror
162Cannot create config.tbl; scanning will failconfig.tbl file creation fails at startuperror
162Disk full errorStorage device has no free space remainingcritical
164No scan managerScan manager service unavailablecritical
168Floppy mount errorCannot mount floppy disk deviceerror
169Floppy unmount errorCannot unmount floppy disk deviceerror
17Memory allocation failureUnable to allocate memory for shape tableerror
17Unable to allocate memory for message buffer dp_msgbufMemory allocation during initializationcritical
170Floppy mkfs errorCannot create filesystem on floppy diskerror
171Floppy format errorCannot format floppy diskerror
172Write file failed; Rewind Error; Tape positioning error; Error writing filemark to tapeCannot write data to tape or rewind/position tapeerror
173No last tape dir entry foundTape directory structure corrupted or missingerror
173Tape read errorCannot read data from tapeerror
173O-Disk Write Error, Unable to search for next image, Unable to transfer tape DB files, Error tried to delete current study, No eot file found, Incomplete study found error, Invalid tape format error, Empty tape error, Tape read error, No last tape dir entry found, No Tape File Sequence Number, Unable to write to floppyMultiple archival, database, or storage operation failurescritical
173Incomplete study found errorStudy archive incomplete or corruptederror
173Unable to write to floppyCannot write data to floppy diskerror
174Unable to allocate memory for image header bufferMemory allocation for image header data structurecritical
174 (dbtb)Unable to allocate memory for file tableMemory allocation request failserror
174 (didb)Unable to allocate memory for image header bufferMemory allocation request failserror
17 (dirp)Unable to allocate memory segment dirpmsgShared memory allocation failserror
17 (dpud)Unable to allocate Graphics Instruction memory segmentShared memory allocation failserror
17-rdbpUnable to allocate memory buffer for rdbi messagesMemory allocation failurecritical
18Unable to release memory segmentMemory deallocation during task shutdown or resource cleanupwarning
1 (dpud)Unable to create message exchange (gkxqname, ttxqname, vtsync)Message exchange creation failserror
1-rdbpUnable to create message exchange RDBP or PARAMessage exchange initialization failurecritical
2Cannot attach to exchange or StopSIF cannot attach to SFMNModule initialization failure during startuperror
2Unable to attach to message exchange of DMIXInter-process communication attachment during startuperror
200+ISAM error 200 or higherAny ISAM error code 200 or abovecritical
200Data file too big for floppy or bad header errorAttempting to process data file exceeding floppy capacity or corrupted headererror
200SCANMAN error attaching to databaseerror
2006Invalid GPU commandInvalid or unsupported command request from SIF to GPUerror
2007Interference limitCouch-gantry collision attempt or servo mode movement would cause interferencewarning
2008Register load errorGPU or XSC parameter register read value does not match load value after verificationerror
2009Vertical motion errorCouch vertical movement exceeds 1mm deadband during active scanerror
201SCANMAN error opening databaseerror
2010Tilt motion errorGantry tilt exceeds 0.25 degree deadband during active scanerror
202SCANMAN error closing databaseerror
203SCANMAN error reading database fielderror
204SCANMAN error writing to database fielderror
205Error cloning rdbDatabase clone operation failserror
206Error resetting flagsFlag reset operation in database failserror
207Error doing a dbfrmnky()dbfrmnky() database function call failserror
207Database error dbfrmkey in task/functionDatabase key frame operationerror
208SCANMAN error with miscellaneous database functionerror
208Misc. database errorUnspecified database operation errorerror
209SCANMAN error sorting databaseerror
210Error doing a dbkeynum()dbkeynum() function failserror
211Error doing a dbfndgeq()dbfndgeq() search function failserror
211Database error dbfrsrec; error code in task/functionDatabase record frame operationerror
212Error searching the databaseDatabase search operation failserror
213SCANMAN error allocating file via databaseerror
214SCANMAN error deleting database entryerror
215Database error dbsiglen in task/functionDatabase signal length operationerror
215Error adding image to databaseImage insertion into database failserror
216Error doing a dbsiglen()dbsiglen() function failserror
216Database error dbmovkey in task/functionDatabase key move operationerror
217Error doing a dbmovkey()dbmovkey() function failserror
218Error doing a dbgetfld()dbgetfld() field retrieval failserror
219Error updating rdbRelational database update operation failserror
220Task aborted prematurelyRunning task terminates unexpectedlyerror
221Error doing dbcredbc() for studiesDatabase creation function fails during studies operationerror
222Insufficient startup argumentsApplication launched with missing required argumentserror
25Unable to signal event to a task PPT2Event signaling failure to PPT2 taskerror
2 (dirp)Unable to attach to message exchange nameNamed queue attachment failserror
2 (dpud)Unable to attach to DPUC message exchangeMessage exchange attachment failserror
2-rdbpUnable to attach to message exchange DBRPMessage exchange attachment failurecritical
2-rtvu-commUnable to attach to message exchangeCommunication channel initialization failurecritical
3SCANMAN message receive or timeout errorFailed to receive expected message or timeout during receive operationerror
3Unable to request message from message exchangeSystem cannot retrieve message from specified exchangewarning
300Could not enable relayGantdown relay enable failureerror
300System monitor ROM read failureCould not read system monitor ROM after 4 attemptscritical
302Drop in airflow with messageAirflow decreases below acceptable thresholdwarning
303Keyswitch turned back ON after shutdownSystem power restored after improper shutdowninfo
304Rise in ambient temperature with messageAmbient temperature increases above acceptable rangewarning
305Decrease in plenum temperature with messagePlenum temperature decreases below acceptable rangeinfo
306Keyswitch turned off with tube hotPower switch turned off while X-ray tube is at high temperaturecritical
307Unknown tube type or config errorSpindown tube identification or config failurewarning
309Conflicting switch settings detectedDIP switch configuration does not match expected standardwarning
310SMB DIP switches not set to standard configurationDIP switch scan during initializationwarning
311Switch value not found in look-up tableDIP switch position maps to undefined configurationerror
315Option enabled but no responseEnabled option does not respond to communicationwarning
316Error loading phrase with return codesPhrase load operation fails with avret and avstat codeserror
328Required parameter missing or invalid in optable field for libcot conversionlibcot attempts conversion when required field values are not found or invaliderror
33Cannot read super block on deviceDevice super block read fails in imgspace/free/elfree operationscritical
35Can not read super block on (x)File system super block read failure on device (x)error
35Free list indirect error block in file systemFile system free list corruption detected during imgspace operationscritical
37Disk write errorAttempt to write to disk when partition full or filesystem corruptederror
3-rtvu-commUnable to request message from message exchangeMessage request failurecritical
4Cannot send to exchange or StopSIF cannot send to SFMNModule communication failure after attachmenterror
4Unable to send message to message exchangeMessage send operation failed to various exchanges (CROSlucm, Lucm, GETX, DMIX, RESX)error
400Error on table setuperror
401Received error on Reconstruction INITerror
402Received error on Reconstruction STARTerror
403Received error on Reconstruction IMGSTOREerror
404Received error on Reconstruction ABORTerror
405Received error on Reconstruction DATAIN or RECDONEerror
406Did not receive function code from RECON in specified trieserror
407Error receiving IM OKSTU response from IMSUMerror
421Unrecognized message type receivedInvalid message type in inter-process communicationwarning
422Improper process IDInvalid process identifier in messagewarning
424X-ray tube was exposed to high-voltage before warm-up completedHigh-voltage applied during tube cold-start phasecritical
426Cannot load algorithm tableAlgorithm table loading at startup or during operationerror
427Cannot load trackpTrackp resource loadingerror
428Cannot load cdaCDA resource loadingerror
429Unknown function parameter; unknown combination of parameter valuesFunction call with unrecognized parameterserror
431Incorrect startupStartup sequence errorerror
433No response from ELTPELTP component communication attempterror
434No response on filming shutdownFilming system shutdown timeoutwarning
435Function timed out on specified item with errorTimeout during function execution on specified itemerror
435RTD handler timeout or error logger timeoutTubeheat or error logging process timeouterror
436Cycle time value not found in tableCycle time lookup for value 0x0000error
437Cannot delete selection or cannot update pati; cannot select or selection update failedSelection deletion or patient info update operationerror
438Cannot calculate scan angles or cannot determine tilt rangeScan angle calculation or tilt range determinationerror
439Communication problem with MPM or no response from taskMPM communication attempt or task availability checkerror
441Array processor or backprojector disabledArray processor or backprojector component failure or disabled statewarning
4-rtvu-commUnable to send message to message exchangeMessage send failurecritical
5Unable to delete message exchangeCleanup or shutdown procedurewarning
512ANB error - serial communication protocol error between SIF and GPU or SIF and XSCFailure in message transmission or reply reception in serial communication channelerror
529Incorrect amount of data errorFIFO contains unexpected data amount after scan on 68020 SIFerror
530Counter interrupt errorTimeout waiting for counter interrupt during data acquisition on 68020 SIFerror
531Total DMA size errorSIF and MPM DMA calculations do not matcherror
601SCAREMAN critical event timeoutTimer expires before reception of critical event that SCAREMAN waits onerror
603Invalid SCAREMAN/SCAN state errorSCAREMAN encounters invalid state during SCAN command execution; state conflict prevents command actionerror
605Cannot repeat last multi-mode scan procedureRepeat command received but procedure cannot be repeated (e.g. right after system reboot)error
606Unknown event received by SCAREMANSCAREMAN received an undecipherable external eventerror
607Error on alert board - SIF or MPM board communication failure detected during pre-scan testSCAREMAN performs pre-scan check and detects SIF or MPM board in crash conditionerror
7Unable to jam message into exchangeMessage insertion into queue failserror
701Error creating tape databaseTape database creation failserror
702Error doing a get my_slot()Slot retrieval function failserror
704Error doing a sym_to_mpde()Symbol to mode conversion failserror
705Error doing a reg_send()Register send function failserror
706Error doing a reg_recv()Register receive function failserror
721Error doing a rhl_rcp()rhl_rcp() function failserror
722Error retry limit exceededOperation retries exceed configured limiterror
724Error retry limit exceededOperation retries exceed limit againerror
725Unknown msg receivedSystem receives unrecognized message typewarning
726Duplicate receive msg receivedSame message received multiple timeswarning
727Node number is not in valid rangeNetwork node number falls outside valid rangeerror
728Circular msg list is fullCircular message buffer reaches capacityerror
8Unable to spawn child taskProcess creation failed for CBOX or CROS taskserror
8SCANMAN could not spawn child process (recon, imgstor, alloc)error
8SCANMAN process spawn failureCould not spawn SCANMAN subprocess (reconstruction, image storage, or allocator)error
80Error condition exists in SIF systemSystem detects an error conditionerror
8 (dpud)Unable to spawn child task ~gmpProcess creation failserror
8-rtvuUnable to spawn child task HAIRChild process creation failurecritical
9Child task activation failureUnable to activate spawned child processerror
9Unable to activate child taskChild task activation after spawningerror
999Command shell errorUnknown; document does not provide detailsunknown
9 (dpud)Unable to activate child task ~gmpProcess activation fails after spawnerror
9-rtvuUnable to activate child task HAIRChild process activation failurecritical
abrtx of ABORT_TAG to ACKW failedABORT_TAG transmission to ACKW process failedAttempt to send ABORT_TAG to ACKWerror
abrtx of ABORT_TAG to cali failedABORT_TAG transmission to CALI process failedAttempt to send ABORT_TAG to CALIerror
'abrtx' of ABORT_TAG to 'chn' failedFailed to send abort tag to channel taskDuring abort procedure execution in channel taskerror
abrtx of ABORT_TAG to dsnd failedABORT_TAG transmission to DSND process failedAttempt to send ABORT_TAG to DSNDerror
abrtx of ABORT_TAG to pilo failedABORT_TAG transmission to PILO process failedAttempt to send ABORT_TAG to PILOerror
abrtx of ABORT_TAG to recn failedABORT_TAG transmission to RECN process failedAttempt to send ABORT_TAG to RECNerror
abrtx of ABORT_TAG to sdat failedABORT_TAG transmission to SDAT process failedAttempt to send ABORT_TAG to SDATerror
ACK/NACK BREAK (ANB)Communication break error between gantry and consoleSignal brush block misalignment during ring diagnostic or normal operationerror
a failure occurred on last allocationMemory allocation failure during 68000 or data memory testInsufficient memory during test executionerror
Aircal missing messageNo air calibration exists for selected protocolAttempt to scan with uncalibrated protocolerror
Alert board error (aaa)Error on alert board; aaa indicates SIF or MPM board in crash conditionSCAREMAN pre-scan test detects SIF or MPM not responding normallyerror
ANB_ERRORANB errorANB system malfunctionerror
Anode Rotor Hard failuresHard error in anode rotor subsystemAnode rotor hard error detected in error logcritical
Anode Rotor soft failuresSoft error in anode rotor subsystemAnode rotor soft error detected in error logwarning
An operation on parent exchange failedParent exchange operation failedSystem attempts operation on parent message exchangeerror
APREPLRECO failed attempting to reply to RECORECO reply operation failed in APREPLRECO processAttempt to send response to RECOerror
a region parametric error occurredRegion parametric error during memory allocationInvalid memory region parameters during testerror
avoice data terminal ready not set error (uart cts)RS 232 handshake control line check errorAuto Voice serial communication initializationerror
avoice request to send not set error (uart dcd)RS 232 handshake control line check errorAuto Voice serial communication initializationerror
Background failuresError in background acquisition processBackground scan acquisition failure detected in error logerror
Bad centering value passed to APInvalid centering parameter sent to Analysis ProcessorAP received invalid centering offset or positionerror
Bad lump value passed to APInvalid lump parameter value sent to Analysis ProcessorAP received out-of-range or malformed lump valueerror
Bad PAR scalar weighing flag passed to APInvalid scalar weighing flag value for PARAP received out-of-range scalar weighing flagerror
Bad PAR scalar weighing value passed to APInvalid scalar weighing coefficient for PARAP received out-of-range weighing valueerror
Bad PAR vector weighing size passed to APInvalid PAR vector weight array size parameterAP received inconsistent vector weighing dimensionerror
Bad return tag from calibration 'pplread'Invalid return tag from calibration readpplread returned unexpected tag valueerror
Bad return tag from recon table pplreadInvalid response tag received from reconstruction table readpplread operation completionerror
Bad 'viewnum' passed to APInvalid view number parameter to Analysis ProcessorAP received out-of-range or invalid view numbererror
Bad 'viewnum' sequenceInvalid sequence of view numbers detectedAP received views in non-sequential or invalid ordererror
Bad 'viewstat' passed to APInvalid view status flag sent to Analysis ProcessorAP received invalid or unexpected view statuserror
BPRDpplread of image from BP did not complete properlyImage read from BP completes but with errors or incomplete dataerror
BPRDImage size too bigImage reconstruction produces output larger than allocated buffererror
BPRD: Image size too bigReconstructed image exceeds maximum size limitImage reconstruction resulted in oversized outputerror
BPRD: pplread of image from BP did not complete properlyIncomplete image data read from BP modulePartial data transfer or timeout during image readerror
BPRD: pplread of image from BP failedFailed to read image data from BP moduleCommunication or data read error from backprojection uniterror
Bus errorBus communication error occurredError detected on system communication buscritical
bwfile failed to write AP save data to fileFailed to write AP save data to disk fileSystem attempts to write AP-provided save data to diskerror
bwfile failed to write calibration data to fileCalibration data write operation failedSystem attempts to save calibration data to diskerror
bwfile failed to write detector fan data to fileDetector fan data write operation failedSystem attempts to write detector fan data to diskerror
bwfile failed to write ripple vector data to fileRipple vector data write operation failedSystem attempts to write ripple vector calibration dataerror
bwfile failed to write source fan data to fileSource fan data write operation failedSystem attempts to write source fan calibration data to diskerror
C872:S22Unable to send FRSTDET message to XIDSKSystem attempts to send FRSTDET message during data acquisitionerror
C872:S22SIF or MPM board in crash condition detected before scanSCAREMAN pre-scan test detects SIF or MPM in crash conditionerror
C872:S22SPEAK CONSOLE address low response errorSPEAK CONSOLE (C) command sent, received incorrect response formaterror
C872:S22Unable to receive message from AP for data saveSystem attempts to receive data save message from acquisition processorerror
CALIB database does not exist, creating oneCalibration database file is being created for first time after software revisionFirst time running calibration procedures after software updateinfo
Can't create erlg exchange ERLXERLX message exchange cannot be createdPERL task initializationcritical
Can't create erlg exchange ERLXSystem cannot create the ERLX error logging exchangeDuring PERL task startupcritical
can't identify plot on displaySystem cannot verify plot was successfully displayedAfter attempting to render plot on display screenerror
can't identify plot on displayDisplay system cannot recognize or communicate with plot processAfter plot process starts, during display connection handshakeerror
Can't receive a message from erlg exchange ERLXSystem cannot receive messages from ERLX exchangeDuring error logging message handlingerror
can't signal done plot on displayMain control unable to send completion signal to plot process on displayAfter acceleration data calculation completes, signaling plot to finishwarning
can't start coddcalc on heurikonAcceleration calculation software failed to launch on Heurikon processorWhen attempting to begin coddcalc process for data analysiserror
can't start plot on displayUnable to launch plot application on display processorWhen system attempts to start graphing moduleerror
can't start plot on displayDisplay plotting software failed to launchWhen attempting to begin graphical display of acceleration and velocity datawarning
CBOXUnable to delete taskTask deletion failureerror
CBOX activateUnable to activate child task CBOXChild task activation attempterror
CBOX deleteUnable to delete task CBOXTask termination or cleanup attemptwarning
Center Cal protocol adjustmentCentering calibration protocol configurationWhen using Center Cal protocol for phantom or centering pin scaninfo
CMDSHL_ERRORCommand Shell errorCommand shell software failurewarning
CMPR 1Unable to create message exchange 'C3dX'System initialization or message queue setuperror
CMPR 25Unable to signal event to a task 'THRE'Event signaling operation during inter-task communicationerror
CMPR 3Unable to request message from message exchange 'C3dX'Message request operation during system communicationerror
Couch position predata word 1 errorCouch position value in predata memory location 1 is invalid or out of expected rangeDuring predata validation before test beginserror
Could not reptstat INITDONE_FAIL to mainFailed to report INITDONE_FAIL status to main processAttempt to report initialization failure to mainerror
Could not reptstat INITDONE_OK to mainFailed to report INITDONE_OK status to main processAttempt to send completion status to mainerror
Could not REPTSTAT to 'recn'Failed to report status to reconstruction componentArray processor initialization or communication failureerror
Could not REPTSTAT to 'shel'Failed to report status to shell componentArray processor initialization or communication failureerror
Creation on AP memory map failedMemory map allocation exceeded available data memoryAP memory map creation during system initializationcritical
Creation on AP memory map failed (data memory exceeded)Memory allocation for AP data failedRECN task creationcritical
'creax' failed for 'cali'CALI task initialization failedProcess creax execution errorerror
'creax' failed for 'chn'Task initialization failed; CHN task suspendsInternal process creation error during CHN task startuperror
creax failed for chnTask creation failed for CHN moduleCHN task initializationcritical
creax failed for cmplTask creation failed for CMPL moduleCHN task initializationerror
Creax failed for dmatDMAT task creation failedDSND task initializationerror
creax failed for dsndDSND task creation failedDSND task initializationcritical
'creax' failed for 'lev'Task creation failed for LEV moduleLEV task initializationcritical
creax failed for levLEV task creation failedLEV task initializationcritical
'creax' failed for 'pilo'PILO task creation failedPILO initialization attemptcritical
'Creax' failed for 'recn'RECN task creation failedRECN process initializationerror
'creax' failed for 'sdat'SDAT task creation failedSDAT process initializationerror
creax failed for shelProcess creation failed for SHEL taskSHEL task initializationerror
CROSUnable to spawn child taskChild task spawn failureerror
CROS deleteUnable to delete task CROSTask termination or cleanup attemptwarning
CROSSUnable to activate child taskChild task activation failureerror
CROSS activateUnable to activate child task CROSSChild task activation attempterror
CROS spawnUnable to spawn child task CROSSystem initialization or task management failureerror
dbip 1Unable to create message exchange of DBIXMessage exchange initialization failure for DBIXerror
dbip 100Unable to get regulus serverRegulus server connection failureerror
dbip 102Unable to receive message from regulus queue of PVDB_MSGMessage receive failure from PVDB_MSG queueerror
dbip 104Unable to get message queue id of DBIR_MSGMessage queue ID lookup failure for DBIR_MSGerror
dbip 17Unable to allocate memory for message buffer dp_msgbufMemory allocation failure during initializationerror
dbip 2Unable to attach to message exchange of DMIXMessage exchange attachment failure for DMIXerror
dbip 4Unable to send message to regulus queue of PVDB_MSGMessage send failure to PVDB_MSG queueerror
dbir 102Unable to receive message from DBIR_MSGMessage receive failure from DBIR_MSG queueerror
dbir 103Unable to send message to IRTB_MSGMessage send failure to IRTB_MSG queueerror
dbir 104Unable to get a message queue id of DBIR_MSGMessage queue ID lookup failure for DBIR_MSGerror
dbir 174Unable to allocate memory for image header bufferMemory allocation failure for image headererror
DBIXUnable to attach message exchangeMessage exchange attach failureerror
DBIX attachUnable to attach message exchange DBIXMessage exchange attachment during initializationerror
DCIP 2Unable to attach to message exchange 'DSPI'DCIP subsystem attempting to connect to DSPIerror
DCIP 26Unable to wait for event condition DCIPEvent wait operation during DCIP processingerror
DCIP-4Unable to send message to message exchange 'DSPI'Message transmission from DCIPerror
Detector number out of range in predata word for first fanFirst fan detector number exceeds valid range in predataInvalid detector number in scan predata worderror
Detector numbers in data not in sequenceDetector number sequence is incorrect in scan dataScan data contains out-of-order or missing detector numberserror
DIAGREPORTDiagnostic error reportDiagnostic procedure generated errorerror
dits counter not reset to 0 errorDigital input/test signal counter did not reset to zeroDuring acceleration test initializationerror
divide by 0 errorPlot file not updated due to mathematical error in data processingBad data received from couch position systemerror
divide by 0 errorMath division by zero in plot calculationInvalid data from couch causing zero divisor in formulaerror
DMA to/from AP failedDirect memory access transfer to or from AP failedSystem attempts DMA operation with acquisition processorcritical
DMIXUnable to attach message exchangeMessage exchange attach failureerror
DMIX attachUnable to attach message exchange DMIXMessage exchange attachment during initializationerror
Drives DisableGantry drive system disabled or inhibitedSignal brush block misalignment during operation or diagnosticerror
DSP_ERRDigital Signal Processor errorDSP system reported error or malfunctionerror
Duplicated AP_ABORTDONE messageAbort done message received multiple timesDuplicate message sent or not cleared after receiptwarning
Duplicated AP_INITDONE messageInitialization done message received multiple timesDuplicate message sent or not cleared after receiptwarning
Duplicated AP_RECONDONE messageReconstruction done message received multiple timesDuplicate message sent or not cleared after receiptwarning
Duplicated AP_STARTDONE messageStart done message received multiple timesDuplicate message sent or not cleared after receiptwarning
eror getsrvrFile open error when getting microcode data fileFile may be locked or gone during diagnostic testerror
ERRORSystem error detected and loggedError condition exists in systemerror
ERROR: bad detector xxxxA detector channel has been identified as defective during center program executionOccurs when center program detects defective detector during global centering constant generationerror
Error executing writeWrite operation to system monitor board failedWrite command failureerror
Error on alert board = aaaSIF or MPM board in crash condition; aaa indicates which boardSCAREMAN pre-scan test detects SIF or MPM not communicating properlyerror
Error reading calibration parametersSystem unable to read calibration parameter dataCalibration memory or file access failurecritical
error reading scan dataScan data acquisition failedCouch did not reach end point or moved during acquisitionerror
error unknownUnknown error conditionError detected but cause cannot be determinedunknown
ESTOPERRImproper ESTOP sequencingEmergency stop sequence violatedcritical
Exposure Ends PrematurelyX-ray exposure terminates before programmed durationHVG generator error or exposure timing circuit faulterror
Failed to allocate segment for bad detectorsMemory allocation failed for bad detector trackingSystem attempts to allocate memory for bad detector listerror
FATALERFatal errorCritical system failurecritical
fatal message errorFatal error condition with unspecified causeVarious critical system failurescritical
fatal message errorFatal error occurred; scan cannot continueVarious system errors including couch positioning or data write failurescritical
FAULTForward drive, bias or overcurrent fault; test mode activeForward drive circuit fault, bias circuit fault, overcurrent condition detected, or during testerror
FIL bit 01 (CRX-125)Open filament detectedFilament circuit open or disconnectederror
FIL bit 01 (CRX-200)Filament feedback faultFilament feedback circuit failureerror
FIL bit 02 (CRX-125)Filament test button pressedTest button activated by operatorinfo
FIL bit 02 (CRX-200)Filament over current detectedFilament current exceeds maximum thresholderror
FIL bit 04 (CRX-125)Filament inverter power supply voltage too lowFilament inverter supply voltage below minimumwarning
FIL bit 04 (CRX-200)Open filament detectedFilament circuit open or disconnectederror
FIL bit 08 (CRX-125)Filament overcurrent detectedFilament current exceeds maximum thresholderror
FIL bit 08 (CRX-200)Filament inverter inoperativeFilament inverter circuit failureerror
FIL bit 10 (CRX-125)Filament inverter shoot-thru sensedFilament inverter shoot-through condition detectederror
FIL bit 10 (CRX-200)Filament inverter shoot-thru sensedFilament inverter shoot-through condition detectederror
FIL bit 20 (CRX-125)15V switched power supplies are too low15V supply voltage below thresholdwarning
FIL bit 20 (CRX-200)Shorted filamentFilament circuit short detectederror
FIL bit 40 (CRX-125)Filament current feedback missingFilament current feedback circuit failureerror
FIL bit 40 (CRX-200)Filament test push button pressed or power supply faultTest button activated or filament supply failurewarning
FIL bit 80 (CRX-125)Missing inverter current senseFilament inverter current feedback missingerror
FIL bit 80 (CRX-200)Cannot select filamentFilament selection circuit failureerror
file: Can't delete image fileUnable to delete image file from storageFile in use or insufficient permissionswarning
file: Can't write header to new image fileUnable to write header data to new image fileFile write failureerror
file read errorFile read error during microcode data retrievalCannot read microcode data file contentserror
file seek errorFile seek error during microcode data retrievalError accessing file position during diagnosticerror
FLOAT_ERRFloating-point exception errorSoftware floating-point math errorerror
get_info:couch position must be outside of view, 450mm or leCouch is positioned too close to or inside the scan circle during pilot scan setupCouch position exceeds 450mm proximity to scan field boundary when pilot scan initiatedwarning
getrenv for $RECON failedEnvironment variable RECON retrieval failedAttempt to read RECON environment variableerror
getsrvr failedServer retrieval operation failedAttempt to get server referenceerror
HCALERRHeat calculator errorHeat calculation software malfunctionwarning
HINTERRHardware interlock ISP errorInterlock system failure or bypass detectederror
HSSHARDHigh Speed Rotor hardware errorHSR hardware malfunctionerror
HSSSOFTHigh Speed Rotor software errorHSR software malfunction or control failureerror
HVBUSH.V. bus voltage greater than 400 VDCHigh voltage bus exceeds 400 volts DCwarning
HVG_INTHigh Voltage Generator hardware errorHVG hardware malfunction or interrupterror
HVI_ERRHigh Voltage Power Supply Interface software errorHVPSI software malfunctionerror
HVIRINTHVPSI hardware errorHigh Voltage PSI hardware malfunctionerror
HVPSI failuresHigh voltage power supply interface failureHVPSI error detected in error logerror
iaddrUnable to allocate memory for message bufferMemory allocation failure for messagingcritical
iaddr bufferUnable to allocate memory for a message buffer, iaddrMessage buffer creation requesterror
IDSK: An operation on parent exchange failedParent exchange operation failureExchange communication errorerror
IDSK: bwfile failed to write AP save data to fileFile write operation failed for AP save dataDisk write errorerror
IDSK: bwfile failed to write calibration data to fileFile write operation failed for calibration dataDisk write error during calibrationerror
IDSK: bwfile failed to write detector fan data to fileFile write operation failed for detector fan dataDisk write error during fan data loggingerror
IDSK: bwfile failed to write ripple vector data to fileFile write operation failed for ripple vector dataDisk write error during calibration data loggingerror
IDSK: bwfile failed to write source fan data to fileFile write operation failed for source fan dataDisk write error during fan data loggingerror
IDSK: DMA to/from AP failedDirect memory access transfer to/from AP failedHardware communication errorcritical
IDSK: Failed to allocate segment for bad detectorsFailed to allocate memory segment for bad detector listMemory allocation failureerror
IDSK: Invalid state transitionSystem attempted invalid state transitionSoftware state machine errorerror
IDSK: More buffers than the length of QueueBuffer count exceeds queue capacityQueue overflow conditionwarning
IDSK: More remote agents than the length of QueueRemote agent count exceeds queue capacityToo many remote agents connectingwarning
IDSK: ppfsendx to AP for ap save data failedFailed to send save data to AP via ppfsendx protocolCommunication protocol errorerror
IDSK: pplread of save data from AP failedFailed to read save data from acquisition processorCommunication or data read errorerror
IDSK: pplread/pplwrite failedFailed to read or write via ppl protocolCommunication protocol errorerror
IDSK: Too many views out of sequence. Buffer overflowData buffer overflow due to out-of-sequence viewsExcessive out-of-order data or slow processingerror
IDSK: Unable to attach to exchange on APFailed to attach to exchange on acquisition processorExchange attachment failureerror
IDSK: Unable to free bad views memory segmentFailed to deallocate bad views memory segmentMemory management error during cleanupwarning
IDSK: Unable to free file parameters memory segmentFailed to deallocate file parameters memory segmentMemory management error during cleanupwarning
IDSK: Unable to grab bad views memory segmentFailed to allocate or access bad views memory segmentMemory allocation failureerror
IDSK: Unable to grab file parameters segmentFailed to allocate or access file parameters memory segmentMemory allocation failureerror
IDSK: Unable to grab parameter memory segmentFailed to allocate or access parameter memory segmentMemory allocation failurecritical
IDSK: Unable to receive message from AP for data saveFailed to receive data save message from acquisition processorCommunication failure during data save operationerror
IDSK: Unable to send calibration ready message to APFailed to send calibration ready notification to APCommunication failure to APwarning
IDSK: Unable to send NOMOREVIEWS message to APFailed to send end-of-acquisition message to APCommunication failure to APerror
IDSK: Unable to send SAVEMPM message to home exchangeFailed to send save message to home exchangeCommunication failure to exchangeerror
IDSK: Unable to send START_PASS_TAG to APFailed to send start pass tag command to APCommunication failure to APerror
illegal signalInvalid signal received by systemMalformed or unexpected signal datawarning
'initx' failed for 'ACKW'Initialization of ACKW task failedACKW task cannot initializeerror
initx failed for ACKWInitialization failed for ACKW processACKW process initializationerror
'initx' failed for 'ACKX'ACKX module initialization failedPILO task startuperror
initx failed for arbi on the BPARBI task initialization failed on backplaneDSND startup sequenceerror
initx failed for caliInitialization failed for CALI (calibration) processCALI process initializationerror
'initx' failed for 'cali'Calibration task initialization failedCalibration process initialization during RECN startuperror
initx failed for chnCHN task initialization failedDSND startup or operationerror
'initx' failed for 'chn'Channel task initialization failedChannel process initialization during RECN startuperror
initx failed for chn in DSNDInitialization failed for CHN module from DSND contextDSND task startuperror
initx failed for dsndInitialization failed for DSND (data send) processDSND process initializationerror
'initx' failed for 'IDSK' on the MPMIDSK initialization failed on MPM moduleIDSK process initialization during SDAT startuperror
'initx' failed for 'iev'Task initialization failedInitialization error in IEV subtask during CHN startuperror
initx failed for levInitialization failed for LEV moduleCHN task startuperror
'initx' failed for 'lev'LEV module initialization failedPILO task startuperror
'initx' failed for 'MRCV' on the MPMMRCV module initialization failed on MPMMPM startuperror
'initx' failed for 'msnd' on the MPMTask initialization failed on Multi-Processor ModuleInitialization error for message send task on MPMerror
'initx' failed for 'pilo'Initialization of pilot component failedPilot component cannot initializeerror
initx failed for piloInitialization failed for PILO processPILO process initializationerror
initx failed for recnInitialization failed for RECN (reconstruction) processRECN process initializationerror
'initx' failed for 'recn'Task initialization failed; CHN suspendsInitialization error in RECN subtaskerror
initx failed for sdatInitialization failed for SDAT processSDAT process initializationerror
'initx' failed for 'sdat'Task initialization failedInitialization error in SDAT (save data) subtaskerror
initx failed for shelSHEL task initialization failedDSND task startup sequencecritical
'initx' failed for 'shel'Shell task initialization failed affecting RECN or SDATShell process initialization during RECN or SDAT startuperror
input & output buffers don't compareInput and output buffer contents do not matchBuffer comparison check failedcritical
Invalid 'numfans' passed to APInvalid number of detector fans parameterAP received invalid detector fan counterror
Invalid 'numproc' passed to APInvalid number of processing units parameterAP received invalid processor counterror
Invalid scantypeScan type parameter is invalid or unrecognizedScan type validation during initializationerror
Invalid sequencer flag after ucode pipelineUnexpected sequencer flag state after microcode executionPipeline completion with invalid flag valueerror
Invalid state transition. (State, Tag)Illegal state transition attempted with given state and tagSystem detects invalid state machine transitionerror
Invalid tag received at home exchangeUnrecognized or malformed message tag receivedCorrupted or unexpected message in inter-task communicationerror
IOCTL() error obtaining tty infoTerminal interface configuration errorTTY info retrieval failureerror
ISAV: file: Can't delete image fileSystem cannot delete image fileImage file deletion operation failurewarning
ISAV: file: Can't write header to new image fileCannot write header to new image fileImage file header write operation failureerror
ISAV: newfile: Can't allocate memory segment to read image hMemory allocation failed for image header readingMemory allocation request during image file header readerror
ISAV: newfile: Can't close newly created image fileUnable to close newly created image fileFile close operation failure after image creationerror
ISAV: newfile: Can't delete full image fileSystem cannot delete full resolution image fileFull image file deletion operation failurewarning
ISAV: newfile: Can't link image and full image filesCannot create link between image and full image filesFile linking operation failureerror
ISAV: newfile: Can't read header from image fileUnable to read image file headerImage header read operation failureerror
ISAV: newfile: Can't release memoryMemory deallocation failedMemory release operation failureerror
ISAV: newfile: Can't rename the image fileUnable to rename image fileImage file rename operation failurewarning
ISAV: newfile: Can't write image to new image fileSystem cannot write image data to newly created fileImage data write operation failureerror
ISAV: Unable to write image data to fileSystem cannot write image data to storageImage file write operation failureerror
KEYX-4Unable to send message to message exchange dmuxTask KEYX executionerror
KV or MA errorsKilovoltage or milliamperage measurement errorKV or MA error detected in error logerror
LED update command not understoodLED control command not recognizedInvalid or incompatible LED commandwarning
LOAD PHRASE (L) command sent, response 0 ( )Phrase load command failed with 4-character response errorOperator enters phrase from menu, system receives incomplete responseerror
LOGO-1Unable to create message exchange LOGXTask LOGO initializationerror
LOGO:1Unable to create message exchange LOGXTask LOGO initialization failureerror
LOGO:17Unable to allocate memory segment SHOWMemory allocation failure during LOGO task startupcritical
LOGO-17Unable to allocate memory segment SHOWTask LOGO memory allocationerror
LOGO-2Unable to attach to message exchange DPRXTask LOGO startuperror
LOGO:2Unable to attach to message exchange DPRXMessage exchange attachment failureerror
LOGO-2aUnable to attach to message exchange dmuxTask LOGO startuperror
LOGO-2bUnable to attach to message exchange LucmTask LOGO startuperror
LOGO:4Unable to send message to message exchange dmuxMessage send operation failedwarning
lwrite error to raw data fileWrite failure to raw data fileFile system or disk I/O error during data writeerror
lwrite of plot.dat errorWrite failure to plot data fileFile system error or bad couch data during plot generationerror
MCAT: Detector number out of range in predata word for firstFirst fan detector number exceeds valid rangeDetector number in predata word exceeds maximum valid valueerror
MCAT: Detector numbers in data not in sequenceDetector data sequence is out of orderDetector numbers read from scan data are non-sequentialerror
MCAT: Error reading calibration parametersCalibration parameters cannot be readCalibration parameter read operation failureerror
MCAT: Pilot mask bit set for CT scan in predata wordPilot mask bit is set in scan predataPilot mask bit flag is on in predata wordwarning
MCAT: Timed out waiting for agents to read calibrationTimeout while agents read calibration dataCalibration read exceeds timeout thresholdwarning
MCAT: Timed out waiting for PROCDONETimeout while waiting for PROCDONE messagePROCDONE message not received within timeout periodwarning
MCAT: Unable to allocate calibration memory segmentCannot allocate memory for calibration dataMemory allocation request for calibration failserror
MCAT: Unable to free calibration memory segmentCannot deallocate calibration memoryMemory deallocation failure for calibration dataerror
MCAT: Unable to free recon parameters memory segmentCannot deallocate reconstruction parameters memoryMemory deallocation failure for recon parameterserror
MCAT: Unable to send IDSKDONE message to home exchangeCannot send IDSKDONE message to home exchangeInter-process communication failure for IDSKDONE messageerror
MCAT: Unable to send IMAGE_IN message to home exchangeCannot send IMAGE_IN message to home exchangeInter-process communication failure for IMAGE_IN messageerror
MCAT: Unable to send message to exchange for OSCNDONE_ACTCannot send OSCNDONE_ACT message to exchangeInter-process communication failure for OSCNDONE_ACT messageerror
MCAT: Unable to send message to exchange for PROCDONE_ACTCannot send PROCDONE_ACT message to exchangeInter-process communication failure for PROCDONE_ACT messageerror
MCAT: Unable to send message to exchange for RAWIN_ACTCannot send RAWIN_ACT message to exchangeInter-process communication failure for RAWIN_ACT messageerror
MCAT: Unable to send PROCDONE message to home exchangeCannot send PROCDONE message to home exchangeInter-process communication failure for PROCDONE messageerror
MENU:2Unable to attach to message exchange MENXMessage exchange attachment failureerror
MENU-2Unable to attach to message exchange MENXTask MENU startuperror
MENU-2aUnable to attach to message exchange RESXTask MENU startuperror
MENU-2bUnable to attach to message exchange CINXTask MENU startuperror
MENU-2cUnable to attach to message exchange COLXTask MENU startuperror
MENU-2dUnable to attach to message exchange IMGXTask MENU startuperror
MENU:4Unable to send message to message exchange RESXMessage send operation failedwarning
MENU-4Unable to send message to message exchange RESXTask MENU executionerror
MENU-4aUnable to send message to message exchange COLXTask MENU executionerror
MENU-4bUnable to send message to message exchange CINXTask MENU executionerror
MENU-4cUnable to send message to message exchange IMGXTask MENU executionerror
MENU:8Unable to spawn child task CNPMChild task spawn operation failederror
MENU-8Unable to spawn child task CNPMTask MENU executionerror
MENU-8aUnable to spawn child task PRWMTask MENU executionerror
MENU-9Unable to activate child task CNPMAfter spawning CNPM taskerror
MENU:9Unable to activate child task CNPMChild task activation failederror
MENU-9aUnable to activate child task PRWMAfter spawning PRWM taskerror
message id set but initdone = 0Message ID set while initialization is not completePremature message ID assignment during initializationerror
micro ld failed trying to load microcode memoryMicrocode load operation failedMicrocode memory loading attemptcritical
MISCERRMiscellaneous error not fitting other categoriesSoftware error not classified elsewherewarning
MOREUnable to release memory segmentMemory deallocation failureerror
More buffers than the length of QueueNumber of buffers exceeds queue length capacitySystem detects buffer count exceeds queue sizewarning
MORE releaseUnable to release memory segment MOREMemory deallocation during shutdown or cleanupwarning
More remote agents than the length of QueueNumber of remote agents exceeds queue lengthSystem detects more agents than queue can handlewarning
MREQERRX_SHOT request errorScan request failed or rejectederror
newfile: Can't allocate memory segment to read image headerMemory allocation failed for image header read operationInsufficient available system memoryerror
newfile: Can't close newly created image fileUnable to close newly created image file after writeFile system error or resource exhaustionerror
newfile: Can't delete full image fileUnable to delete full image fileFile in use or insufficient permissionserror
newfile: Can't link image and full image filesUnable to link image and full image file togetherFile system error or missing fileserror
newfile: Can't read header from image fileUnable to read image file headerFile access error or corrupted fileerror
newfile: Can't release memoryUnable to release allocated memory segmentMemory management errorerror
newfile: Can't rename the image fileUnable to rename image fileFile in use or file system errorerror
newfile: Can't write image to new image fileUnable to write image data to newly created fileFile write failure or storage errorerror
No AudioAudio feedback or alarm not functioningHVG generator error or system malfunctionwarning
No Button Hit DetectedOperator console button not respondingButton press not detected during diagnosticwarning
NOCALFILE_ERRCalibration Request error: requested calibration file cannot be foundCalibration file lookup fails or file is corrupterror
No DMA resource channel in useDMA channel resource unavailableRequested DMA channel is in use or unavailablewarning
No ExposureX-ray generator fails to produce exposureHVG (Spellman) generator malfunction or loss of slip ring powererror
No Indicator (X-ray ON)X-ray ON indicator lamp not illuminatingHVG generator error or indicator circuit faultwarning
no mpc reset initdone = 1MPC reset not performed while initialization is completeSystem initialization state mismatcherror
No Small Drives PowerSmall drives do not have powerLoss of power to small drives subsystemerror
no so. mess. in & out complete interrupt errorNo solicited message input/output complete; no interrupt raisedSolicited operation timeout without interrupt signalerror
NOT_IN_ERRInterpreted as no errorError code value 1000info
no unsol. mess. rcvne interrupt errorNo unsolicited message received; no interrupt errorExpected unsolicited message did not arrive and no interrupt was raisedwarning
ONEUnable to release memory segmentMemory deallocation failureerror
ONE releaseUnable to release memory segment ONEMemory deallocation during shutdown or cleanupwarning
Open failure()Communication initialization failureDevice communication failureerror
OPIXUnable to create message exchangeMessage exchange creation failureerror
OPIX attachUnable to attach message exchange OPIXMessage exchange attachment during initializationerror
OPIX messageUnable to create message exchange OPIXMessage system initializationerror
OSCN: Unable to allocate wtab memory segmentFailed to allocate wtab memory segmentMemory allocation failureerror
OSCN: Unable to free wtab memory segmentFailed to deallocate wtab memory segmentMemory management error during cleanupwarning
OVFLTRail overcurrent fault; current exceeds 50 ampsCurrent on power rails exceeds 50 amperescritical
PARAM_ERRParameter error generated when calfmr receives out-of-range parameterOut-of-range parameter from optable, control, or database; invalid MA offset; unsupported CALM command; buffer handle mismatch; calibration file size too small; parameter size out of range for calibrationerror
Patient Support Horizontal failuresHorizontal patient support positioning failurePatient support horizontal error detected in error logwarning
PDIXUnable to create message exchangeMessage exchange creation failureerror
PDIX messageUnable to create message exchange PDIXMessage system initializationerror
PEDXUnable to attach message exchangeMessage exchange attach failureerror
PEDX attachUnable to attach message exchange PEDXMessage exchange attachment during initializationerror
Pilot mask bit set for CT scan in predata wordPilot scan mode bit incorrectly set in CT scan predataIncorrect scan mode or data corruption in predata wordwarning
plot timeoutPlot software did not complete drawing within timeout periodDuring graphical rendering of acceleration and velocity resultswarning
plot timeoutPlot application failed to complete graphing operation within timeout periodDuring acceleration graph plotting on displayerror
'ppfsendx' of APCSLIB_TAG to MPM failedFailed to send APCSLIB tag to MPMInter-process message send failureerror
ppfsendx of AP_REJECT to BP failedFailed to send rejection message to backplaneDSND rejects data or operationerror
'ppfsendx' of column read request to the MPM failedColumn read request transmission to MPM failedColumn data read requesterror
'ppfsendx' of column request to the MPM failColumn request transmission to MPM failedColumn processing requesterror
'ppfsendx' of FFT buffer request to the MPM failedFFT buffer request transmission to MPM failedIPC send failure for FFT processing buffererror
'ppfsendx' of first buffer request to the MPM failedFailed to send initial buffer request to MPMInter-process message send failureerror
'ppfsendx' of first buffer request to the MPM failedBuffer request transmission to MPM failedIPC send failure when requesting first processing buffererror
'ppfsendx' of first column request to the MPM failedFirst column data transmission to MPM failedColumn data processingerror
'ppfsendx' of first row request to the MPM failedFirst row data transmission to MPM failedData processing initiationerror
'ppfsendx' of float buffer request to the MPM failedFloating-point buffer request transmission to MPM failedIPC send failure for float buffer requesterror
'ppfsendx' of integer buffer request to the MPM failedInteger buffer request transmission to MPM failedIPC send failure for integer buffer requesterror
'ppfsendx' of row request to the MPM failedRow request transmission to MPM failedRow processing requesterror
ppfsendx to AP for ap save data failedFailed to send save data to AP via ppfsendxSystem attempts to send save data to APerror
'pplread' completion tag not PPLR_CMP_TAGpplread operation completed with error statuspplread completionerror
'pplread' failed for calibration readCalibration read operation failedpplread process execution errorerror
pplread failed for recon table readReconstruction table read operation failedpplread function executionerror
pplread of save data from AP failedFailed to read save data from acquisition processorSystem attempts to read saved data from APerror
pplread/pplwrite failedPPL read or write operation failedSystem attempts PPL communication operationerror
pplwrite completion tag not PPLW SEND OKWrite completion returned unexpected status codeDSND receives write completion notificationerror
pplwrite completion tag not PPLW SEND OKPPL write completion tag does not indicate successful sendPPL write operation completion in DSND taskerror
'pplwrite' completion tag not PPLW_SEND_OKpplwrite operation completed with error statuspplwrite completionerror
'pplwrite' of rows to the MPM failedRow data write to MPM failedData writing operationerror
pplwrite of views to the BP/EB failedFailed to write image views to backplane/expansion boardDSND attempts to write reconstructed viewserror
'ppsendx' of read msg to 'IDSK' failedFailed to send read message to IDSK via parallel port sendDuring data read from IDSK in SDAT taskerror
Predata sample x =x should = xPredata sample value does not match expected value at starting positionValidation of initial measurement sample before data collection startserror
ptrUnable to allocate memory segmentMemory allocation failurecritical
ptr memoryUnable to allocate memory segment ptrMemory allocation request during startup or operationcritical
QSPIERRQueued Serial Peripheral Interface errorQSPI communication failureerror
rcv. unsol. mess. timeoutReceive unsolicited message timeoutUnsolicited message reception did not complete within timeout periodwarning
readerrError logging and help message display system for autocal failuresAny error during Air Cal Touch-up or autocal processwarning
REGUUnable to get process idProcess ID lookup fails for a required moduleerror
RegulusUnable to get Regulus message queue idQueue ID retrieval failureerror
Regulus queue idUnable to get a Regulus message queue idQueue ID retrieval during initializationcritical
Regulus queue sendUnable to send a message to Regulus queueMessage transmission to Regulus subsystemerror
REGU: Unable to get process idFailed to retrieve process identifierSystem call to obtain process ID failederror
Relay ('sendx') of END_TAG to 'pilo' failedFailed to relay end tag to pilot componentInter-task communication failureerror
Relay ('sendx') of MPM_NOMOREVIEWS_TAG to 'chn' failedFailed to relay no more reviews tag to channel componentInter-task communication failureerror
Relay ('sendx') of P_PASS_TAG to 'pilo' failedFailed to relay pass tag to pilot componentInter-task communication failureerror
Relay ('sendx') of PPLW_CMP_TAG to 'chn' failedFailed to relay pipeline complete tag to channel componentInter-task communication failureerror
Relay ('sendx') of START_PASS_TAG to 'pilo' failedFailed to relay start pass tag to pilot componentInter-task communication failureerror
'reqx' failed at home exchangeRequest operation failed at central message hubCommunication or processing failure at home exchangeerror
'reqx' failed for COL_CHN ucode pipeline completionCOL channel ucode pipeline completion request failedPipeline processingerror
'reqx' failed for FLTAIR_CHN ucode pipeline completionFLTAIR channel ucode pipeline completion request failedPipeline processingerror
'reqx' failed for ROW_CHN ucode pipeline completionROW channel ucode pipeline completion request failedPipeline processingerror
'reqx' failed for ucode pipeline completionRequest for microcode pipeline completion failedMicrocode pipeline not responding or timeouterror
'reqx' failure at 'ACKX' waiting for 'pplread' completionACKX module timeout waiting for pplread completionData read operation timeouterror
reqx failure at cmpl waiting for save data completionRequest failed at CMPL waiting for SDAT completionData save completion timeout in CHN taskerror
reqx failure at dmat waiting for pplwrite completionRequest failed at DMAT waiting for write completionDSND synchronizes with view write operationerror
'reqx' failure at 'pilo' waiting for 'pplwrite' completionPILO module timeout waiting for pplwrite completionData write operation timeouterror
RESXUnable to attach message exchangeMessage exchange attach failureerror
RESX attachUnable to attach message exchange RESXMessage exchange attachment during initializationerror
Retry expirationMessage retry limit exceededMessage transmission retry count reached maximumerror
retsrvr failed trying to release serverServer release operation failedAttempt to release server resourceerror
rfile failed for downloading of twiddle tableTwiddle table download operation failedTwiddle table file read/download attempterror
ROTOR_TIMERRotor timer message; warning or timeout indicatorRotor timing anomaly detectedwarning
RTR_ERRRotor software errorRotor control software malfunctionerror
RTRRINTRotor hardware errorRotor hardware malfunction or interrupterror
RVDP 1Unable to create message exchange 'RVDX'RVDP subsystem initializationerror
RVDP-1bUnable to create message exchange 'RMRX'RVDP module initializationerror
RVDP-3Unable to request message from message exchange 'RVDX'Message retrieval from RVDP exchangeerror
RVDP 4Unable to send a message to message exchange 'RMRX'Message transmission to RMRX during operationerror
RVDP-4bUnable to send a message to message exchange 'CRVX'Outgoing message transmissionerror
sagc1Unable to create message exchange SAG0Message exchange creation failserror
sagc17Unable to allocate memory for strip_buf bufferMemory allocation failserror
sagc2Unable to attach message exchange SAGXMessage exchange attachment failserror
sagc8Unable to spawn task SCCRTask creation failserror
sagc9Unable to activate process SCCRProcess activation failserror
SC1 0001Inverter chassis was source of faultInverter chassis fault detectederror
SC1 0002AC Input chassis was source of faultAC Input chassis fault detectederror
SC1 0004Filament Chassis was source of faultFilament Chassis fault detectederror
SC1-0008Inverter Diag was source of faultInverter Diag fault detectederror
SC1-0010Panel Interlock–Inverter or AC Input faultPanel interlock fault detectederror
SC1-0020LCL Power–/+ 15 vSW missing on System Control PCBPower supply voltage missingcritical
SC1 0040Shutdown– the XSC shutdown the HVG's contactorXSC initiated HVG contactor shutdownwarning
SC1-0080ALE (kv>30) without EXGATEHigh voltage output without gate commandcritical
SC1 0100Regulation Error– KV out of tolerance > 1%KV output exceeds tolerance by more than 1%error
SC1 0200Inverter Frequency Max detectedInverter operating frequency at maximumwarning
Scan Data Acquisition failuresScan data acquisition process failureScan data acquisition error detected in error logerror
Scan Drive positioning failuresScan drive unable to position correctlyPositioning error or failure at power-uperror
scan positioning timeoutCouch positioning failed to complete within expected timeDuring initial couch positioning at acceleration test starterror
SCIERRMC68331 serial diagnostic terminal errorMC68331 serial communication malfunctionerror
SDRVSERSmall drives software errorSmall drive control software malfunctionerror
See Error LoggerSystem-level errors detected during startup or operationBootstrap completion or during normal operationunknown
sendx failed on AP_FREE_BUFF to chnFailed to send buffer-free message to CHN taskDSND attempts to release buffererror
sendx of AP_DMN_OUT to dsnd failedFailed to send DMN output message to DSND taskCHN task output request to DSNDerror
'sendx' of AP_DONE_SAVEDATA to requesting task failedFailed to send save complete message to requesting taskAP task completing SAVEDATA operationerror
sendx of AP_SAVEDATA to sdat failedFailed to send save data message to SDAT taskCHN task data save requesterror
'sendx' of AP_SAVEDATA to 'sdat' failedFailed to send save-data command to storage taskIPC send failure to SDAT (save data) taskerror
'sendx' of microcode pipeline complete failedMessage transmission of microcode pipeline completion failedMicrocode pipeline completion eventerror
sendx of microcode pipeline complete failedFailed to send microcode pipeline completion message from LEV taskLEV task pipeline completionerror
'Sendx' of RDCAL_TAG to 'cali' failedFailed to send read calibration tag to calibration taskDuring calibration data transmission in RECN taskerror
'Sendx' of RDCAL TAG to 'cali' failedRDCAL tag transmission to calibration module failedCalibration data exchangeerror
SHUFNo free buffers for shuffleSENDVIEW attempts to allocate buffer during image reconstructionwarning
SHUFpplwrite to AP did not complete (tracer = mid)Data write to AP module interrupted or stalled mid-transfererror
SHUFUnable to allocate memory for reconmapMemory allocation fails during reconstruction map setuperror
SHUFUnable to free buffer: AP return address mismatchBuffer deallocation detects address mismatch with AP modulecritical
SHUFUnable to send NOMOREVIEWS messageSHUF cannot notify completion of view processingerror
SHUFTimed out waiting for buffer request (maybe AP)Buffer request from AP module does not arrive within timeout periodwarning
SHUFStarting View number out of rangeAcquisition initiated with invalid starting view numbererror
SHUF: AP return address mismatchCannot free buffer due to address mismatch with AP moduleBuffer deallocation attempted with incorrect return addresserror
SHUF: Failed trying to send buffer to MSNDUnable to send processed buffer to MSND moduleCommunication failure during buffer handofferror
SHUF: Invalid view number out of rangeView number parameter is outside valid rangeOut-of-range view number encountered during processingerror
SHUF: No free buffers for shuffleInsufficient buffer memory available for shuffle operationBuffer pool exhausted during shuffle message processingerror
SHUF: pplwrite to AP did not completeWrite operation to AP module incompleteCommunication failure during data transfer to APerror
SHUF: Starting View number out of rangeView number parameter is outside valid rangeInvalid starting view number provided to SHUFerror
SHUF: Timed out waiting for buffer requestBuffer request from AP did not arrive within timeout periodAP process failed to request buffer within expected timeerror
SHUF: Unable to allocate memory for reconmapInsufficient memory to allocate reconstruction mapMemory exhaustion during reconmap allocationcritical
SHUF: Unable to free calibration memory segmentFailed to deallocate calibration memory segmentMemory deallocation error during cleanupwarning
SHUF: Unable to free reconbuff memory segmentFailed to deallocate reconstruction buffer memory segmentMemory deallocation error during cleanupwarning
SHUF: Unable to grab calibration memory segmentFailed to allocate calibration memory segmentMemory allocation failure during calibration setuperror
SHUF: Unable to send FRSTDET message to XIDSKFailed to send FRSTDET message to XIDSKSystem processing error during message transmissionerror
SHUF: Unable to send NOMOREVIEWS messageFailed to send NOMOREVIEWS completion messageCommunication failure after view processingerror
SHUF: Unable to send view buffer ready message to MSNDFailed to notify MSND that view buffer is readyCommunication error during buffer handofferror
Small drives failuresSmall drives subsystem failureSmall drives error detected in error logerror
solicited input completed in errorSolicited input completed with error statusInput operation reported error status on completionerror
solicited input complete timeoutSolicited input completion did not occur within timeoutInput operation timeout during solicited message handlingerror
solicited output completed in errorSolicited output completed with error statusOutput operation reported error status on completionerror
Solicited output complete timeoutSolicited output completion did not occur within timeoutOutput operation timeout during solicited message handlingerror
SPAWNTIMESystem initialization timeout in XSC+XSC+ initialization exceeds time limitwarning
Speak Phrase Overtime ErrorSystem timeout before receiving response to previous commandPrevious command response not received before new command issuederror
SPOTERRSpot software errorSpot control software malfunctionerror
STARTPROC_TAG received before START successfully finishedSTARTPROC_TAG arrived before START sequence completedPremature STARTPROC_TAG receptionerror
'strtx' of AP_RUN_CHAIN to 'chn' failedFailed to start chain execution in CHN taskIPC start failure when ordering chain runerror
strtx of AP_RUN_CHAIN to chn failedFailed to start AP_RUN_CHAIN on CHN taskChain run initiation in CHN taskerror
strtx of BP_NOMOREVIEW_TAG to chn failedStart request for BP no-more-review tag to CHN task failedDSND attempts to start CHN with messageerror
'strtx' of MPM_NOMOREVIEWS_TAG to 'chn' failedFailed to start/send end-of-data tag to CHN taskIPC start failure when forwarding MPM completionerror
strtx of MPM_NOMOREVIEWS_TAG to dsnd failedFailed to start no-more-reviews tag on DSND taskReview termination request in CHN taskwarning
strtx of STARTPROC_TAG to ACKW failedSTARTPROC_TAG transmission to ACKW process failedAttempt to send STARTPROC_TAG to ACKWerror
'Strtx' of STARTPROC_TAG to 'chn' failedFailed to send start procedure tag to channel taskDuring procedure initiation in channel taskerror
strtx of STARTPROC_TAG to dsnd failedSTARTPROC_TAG transmission to DSND process failedAttempt to send STARTPROC_TAG to DSNDerror
strtx of STARTPROC_TAG to pilo failedSTARTPROC_TAG transmission to PILO process failedAttempt to send STARTPROC_TAG to PILOerror
strtx of STARTPROC_TAG to recn failed (1)STARTPROC_TAG transmission to RECN process failed (first instance)Attempt to send STARTPROC_TAG to RECNerror
Strtx of START_TAG to ACKW failedSTART_TAG transmission to ACKW process failedAttempt to send START_TAG to ACKWerror
strtx of START_TAG to cali failedSTART_TAG transmission to CALI process failedAttempt to send START_TAG to CALIerror
'Strtx' of START_TAG to 'chn' failedFailed to send start tag to channel taskDuring channel startup in RECN taskerror
strtx of START_TAG to dsnd failedSTART_TAG transmission to DSND process failedAttempt to send START_TAG to DSNDerror
strtx of START_TAG to pilo failedSTART_TAG transmission to PILO process failedAttempt to send START_TAG to PILOerror
strtx of START_TAG to recn failedSTART_TAG transmission to RECN process failedAttempt to send START_TAG to RECNerror
strtx of START_TAG to sdat failedSTART_TAG transmission to SDAT process failedAttempt to send START_TAG to SDATerror
THDP-17Unable to allocate memory segment MPR_LOADMemory allocation during THDP operationerror
THDP 2Unable to attach to message exchange 'THDX'THDP subsystem attempting to connect to THDXerror
Timed out before receiving second RDCAL messageCalibration message timeoutExpected RDCAL message not received within timeout perioderror
Timed out waiting for agents to read calibrationCalibration read operation exceeded timeout thresholdSlow process response or communication delayerror
Timed out waiting for calibration 'pplread' completeCalibration read operation timeoutpplread completion signal not receivederror
Timed out waiting for PROCDONEPROCDONE message reception exceeded timeout thresholdDelayed process completion or communication failureerror
Timed out waiting for recon table pplread completeReconstruction table read operation exceeded timeout thresholdpplread table read operationerror
Time outOperation timeoutOperation did not complete within timeout perioderror
time out on readButton press not detected within timeout periodButton not pressed during test or button failed to register press signalwarning
Time-Out on read of echo backNo response from system monitor board within timeoutBoard not respondingerror
timeout on signal from coddcalc doneCoddcalc did not send completion signal within timeout periodAfter scan data collection, waiting for coddcalc calculation completionerror
timeout on signal from coddcalc doneCoddcalc failed to send completion signal within timeout periodAfter scan data collection, waiting for coddcalc to finish calculationserror
timeout on signal from coddcalc to start scanNo signal received from coddcalc to initiate scan within time limitAfter coddcalc launches, waiting for start-scan signalerror
timeout on signal from coddcalc to start scanCoddcalc calculation module failed to send scan start signal within timeout periodAfter coddcalc is started, waiting for signal to begin scanningerror
too many points out of rangeExcessive invalid data points from couch sensorCouch sensor malfunction or transmission error during scanerror
Too many views out of sequence. Buffer overflowView buffer overflow due to out-of-sequence viewsSystem receives more out-of-sequence views than buffer capacitycritical
TST1High voltage generator test register 1 status checkSystem reads TST1 register during fault diagnosiserror
Unable to activate child task ISVRCannot activate ISVR child processProcess activation failure after creationerror
Unable to activate child task WR00System cannot activate the WR00 child taskDuring CHRD task executionerror
Unable to activate child task WR00Child task WR00 cannot be activatedTask CHRD startup sequenceerror
Unable to activate child task WR01Child task WR01 cannot be activatedTask CHRD startup sequenceerror
Unable to activate child task WR01System cannot activate the WR01 child taskDuring CHRD task executionerror
Unable to activate child task WR02Child task WR02 cannot be activatedTask CHRD startup sequenceerror
Unable to activate child task WR02System cannot activate the WR02 child taskDuring CHRD task executionerror
Unable to activate child task ZARMCannot activate ZARM child processProcess activation failure after creationerror
Unable to allocate calibration memory segmentFailed to allocate memory for calibration parametersInsufficient available system memoryerror
Unable to allocate memory segment 256System cannot allocate memory segment 256During memory initialization or allocation requestcritical
Unable to allocate memory segment 257System cannot allocate memory segment 257During memory initialization or allocation requestcritical
Unable to allocate memory segment 258System cannot allocate memory segment 258During memory initialization or allocation requestcritical
Unable to allocate memory segment dbl_buffMemory allocation failed for double buffer segmentSystem memory exhaustion or allocation errorerror
Unable to allocate memory segment img_hdrMemory allocation failed for image header segmentSystem memory exhaustion or allocation errorerror
Unable to allocate memory segment img_sizeMemory allocation failed for image size segmentSystem memory exhaustion or allocation errorerror
Unable to allocate memory segment reg_msgMemory allocation failed for registry message segmentSystem memory exhaustion or allocation errorerror
Unable to allocate memory segment "semabuf"Shared memory segment allocation failureDuring initialization of semaphore buffererror
Unable to allocate message buffer memorySystem cannot allocate memory for message buffersDuring message buffer initialization or allocationcritical
Unable to allocate wtab memory segmentFailed to allocate wtab memory segmentSystem attempts to allocate wtab memoryerror
Unable to attach to exchange on APFailed to attach to message exchange on acquisition processorSystem attempts to establish exchange connection to APerror
Unable to attach to message exchange ACKWCannot connect to ACKW message exchangeApplication startup or inter-process communication failureerror
Unable to attach to message exchange CINXCannot connect to CINX message exchangeApplication startup or inter-process communication failureerror
Unable to attach to message exchange COLXCannot connect to COLX message exchangeApplication startup or inter-process communication failureerror
Unable to attach to message exchange DBIXCannot connect to DBIX message exchangeApplication startup or inter-process communication failureerror
Unable to attach to message exchange DMIXCannot connect to DMIX message exchangeApplication startup or inter-process communication failureerror
Unable to attach to message exchange GEPVCannot connect to GEPV message exchangeApplication startup or inter-process communication failureerror
Unable to attach to message exchange GOCXCannot connect to GOCX message exchangeApplication startup or inter-process communication failureerror
Unable to attach to message exchange img_chldImage child process communication attachment failedDuring image processing subsystem initializationerror
Unable to attach to message exchange MULTCannot connect to MULT message exchangeApplication startup or inter-process communication failureerror
Unable to attach to message exchange PILXCannot connect to PILX message exchangeApplication startup or inter-process communication failureerror
Unable to attach to message exchange PRVXCannot connect to PRVX message exchangeApplication startup or inter-process communication failureerror
Unable to attach to message exchange RESXCannot connect to RESX message exchangeApplication startup or inter-process communication failureerror
Unable to attach to message exchange RTVXCannot connect to RTVX message exchangeApplication startup or inter-process communication failureerror
Unable to attach to message exchange ZCUXCannot connect to ZCUX message exchangeApplication startup or inter-process communication failureerror
Unable to create message exchange chrdSystem cannot create the chrd message exchangeDuring CHRD task startupcritical
Unable to create message exchange chrdMessage exchange for CHRD task cannot be createdTask CHRD startupcritical
Unable to create message exchange 'CURC'System initialization failure for core message queueApplication startup phase when establishing inter-process communicationcritical
Unable to create message exchange HZR_Cannot create HZR_ message exchangeMessage exchange creation failure during initializationerror
Unable to create message exchange REGXCannot create REGX message exchangeMessage exchange creation failure during initializationerror
Unable to create message exchange RMTXCannot create RMTX message exchangeMessage exchange creation failure during initializationerror
Unable to create message exchange SVRXCannot create SVRX message exchangeMessage exchange creation failure during initializationerror
Unable to create message exchange wr00Message exchange for WR00 cannot be createdChild task WR00 initializationcritical
Unable to create message exchange wr00System cannot create the wr00 message exchangeDuring WR00 task startupcritical
Unable to create message exchange wr01Message exchange for WR01 cannot be createdChild task WR01 initializationcritical
Unable to create message exchange wr01System cannot create the wr01 message exchangeDuring WR01 task startupcritical
Unable to create message exchange wr02Message exchange for WR02 cannot be createdChild task WR02 initializationcritical
Unable to create message exchange wr02System cannot create the wr02 message exchangeDuring WR02 task startupcritical
Unable to create message exchange XprvCannot create Xprv message exchangeMessage exchange creation failure during initializationerror
Unable to free bad views memory segmentFailed to deallocate bad views memory segmentSystem attempts to free memory after processing bad viewserror
Unable to free calibration memory segmentFailed to release calibration memory segmentMemory management errorerror
Unable to free file parameters memory segmentFailed to deallocate file parameters memory segmentSystem attempts to free file parameters memoryerror
Unable to free recon parameters memory segmentFailed to release reconstruction parameters memory segmentMemory management errorerror
Unable to free wtab memory segmentFailed to deallocate wtab memory segmentSystem attempts to free wtab memory during cleanuperror
Unable to get Regulus message queue XKEYCannot retrieve XKEY message queue from RegulusMessage queue retrieval failureerror
Unable to grab bad views memory segmentFailed to allocate memory segment for bad views trackingSystem attempts to allocate bad views memoryerror
Unable to grab file parameters segmentFailed to allocate file parameters memory segmentSystem attempts to allocate file parameters memoryerror
Unable to grab parameter memory segmentFailed to allocate parameter memory segmentSystem attempts to allocate memory for parameterserror
Unable to open device/driver 256System cannot access device/driver 256Device initialization or access attempterror
Unable to open device/driver 257System cannot access device/driver 257Device initialization or access attempterror
Unable to open device/driver 758System cannot access device/driver 758Device initialization or access attempterror
Unable to open device/driver CHANNELSSystem cannot access the CHANNELS device driverTask CHRD initialization or operationerror
Unable to read from device/driver 256Cannot read data from device driver 256Data read request to device 256error
Unable to read from device/driver 257Cannot read data from device driver 257Data read request to device 257error
Unable to read from device/driver 258Cannot read data from device driver 258Data read request to device 258error
Unable to request message from message exchange chrdCannot retrieve message from CHRD message exchangeTask CHRD message handlingerror
Unable to request message from message exchange wr00System cannot receive messages from wr00 exchangeDuring WR00 task message handlingerror
Unable to request message from message exchange wr02System cannot receive messages from wr02 exchangeDuring WR02 task message handlingerror
Unable to request message from message exchange wr0lCannot retrieve message from message exchange wr0lMessage request during operationerror
Unable to send calibration ready message to APFailed to send calibration ready notification to APSystem attempts to notify AP that calibration is readyerror
Unable to send IDSKDONE message to home exchangeFailed to send IDSKDONE message to home exchangeInter-process communication failureerror
Unable to send IMAGE_IN message to home exchangeFailed to send IMAGE_IN message to home exchangeInter-process communication failureerror
Unable to send message to exchange for OSCNDONE_ACTFailed to send OSCNDONE_ACT message to message exchangeInter-process communication failureerror
Unable to send message to exchange for PROCDONE_ACTFailed to send PROCDONE_ACT message to message exchangeInter-process communication failureerror
Unable to send message to exchange for RAWIN_ACTFailed to send RAWIN_ACT message to message exchangeInter-process communication failureerror
Unable to send message to Regulus queue XKEYCannot send message to XKEY Regulus queueMessage send failure to Regulus queueerror
Unable to send NOMOREVIEWS message to APFailed to send NOMOREVIEWS message to acquisition processorSystem attempts to notify AP that scan is completeerror
Unable to send PROCDONE message to home exchangeFailed to send PROCDONE message to home exchangeInter-process communication failureerror
Unable to send SAVEMPM message to home exchangeSAVEMPM message transmission failed to home exchangeSystem attempts to send save data message to home exchangeerror
Unable to send START_PASS_TAG to APFailed to send START_PASS_TAG message to acquisition processorSystem attempts to initiate pass tag sequence on APerror
Unable to spawn child task ISVRCannot create ISVR child processProcess creation failure during startuperror
Unable to spawn child task "lcal"Child process launch failure for calibration taskDuring calibration subsystem initializationerror
Unable to spawn child task WR00System cannot spawn the WR00 child taskDuring CHRD task initializationerror
Unable to spawn child task WR00Child task WR00 cannot be spawnedTask CHRD initializationerror
Unable to spawn child task WR01System cannot spawn the WR01 child taskDuring CHRD task initializationerror
Unable to spawn child task WR01Child task WR01 cannot be spawnedTask CHRD initializationerror
Unable to spawn child task WR02Child task WR02 cannot be spawnedTask CHRD initializationerror
Unable to spawn child task WR02System cannot spawn the WR02 child taskDuring CHRD task initializationerror
Unable to spawn child task ZARMCannot create ZARM child processProcess creation failure during startuperror
Unable to write image data to fileImage data cannot be written to file storageMemory allocation or file operation failure during image writeerror
Unable to write to device/driver CHANNELSCannot write data to CHANNELS device driverData transmission attempt to CHANNELSerror
Un-calibrated protocolNo aircal exists for selected protocolAttempting to scan with protocol that lacks air calibrationerror
unexpected message interrupt error interrupt bit $xUnexpected message interrupt received with interrupt bit setInterrupt signal received in unexpected contextwarning
unexpected $ not enabled (mct1) mess. interrupt error interrMessage interrupt received on disabled MCT1 channelInterrupt signal on disabled communication channelerror
unsol. mess. xmit errorUnsolicited message transmission errorError during unsolicited message transmissionerror
waddrUnable to release memory segmentMemory deallocation failureerror
waddr memoryUnable to allocate memory segment waddrMemory allocation request during startup or operationcritical
waddr releaseUnable to release memory segment waddrMemory deallocation during shutdown or cleanupwarning
Warning: NEW FILENAME NOT UNIQUE /usr/IQ/site/CA.AAAAAAAASystem is creating unique filename for calibration data because requested name already existsOccurs during program execution when a new filename needs to be createdinfo
Warning: pin not very well centered, or detector is badCentering pin is not well centered or a detector has failedCenter program detects off-center pin position or bad detector affecting measurementwarning
Wrong state when AP_ABORTDONE receivedAP_ABORTDONE received while array processor in unexpected stateAbort done message received out of sequenceerror
Wrong state when AP_DEN_OUT receivedInvalid state machine condition for data output message in DSNDAP_DEN_OUT message arrival in DSND taskwarning
Wrong state when AP_DONE_SAVEDATA receivedState machine error on data save completionData save completion signal received in wrong stateerror
Wrong state when AP_FREE_BUFF receivedInvalid state machine condition for buffer free messageAP_FREE_BUFF message arrival in CHN taskwarning
Wrong state when AP_INITDONE receivedAP_INITDONE received while array processor in unexpected stateInitialization complete message received out of sequenceerror
Wrong state when AP_READCALI_DONE receivedUnexpected state during calibration completionAP_READCALI_DONE message received in invalid stateerror
Wrong state when AP_READPARMS_DONE receivedUnexpected state during parameter read completion signalAP_READPARMS_DONE tag receivederror
Wrong state when AP_RECONDONE receivedAP_RECONDONE received while array processor in unexpected stateReconstruction done message received out of sequenceerror
Wrong state when AP_RUN_CHAIN receivedUnexpected state during chain run requestAP_RUN_CHAIN message received in invalid stateerror
Wrong state when AP_RUN_CHAIN receivedInvalid state machine condition for run chain messageAP_RUN_CHAIN message arrival in CHN taskwarning
Wrong state when AP SAVEDATA receivedAP task received SAVEDATA message in unexpected stateAP task receives SAVEDATA command while not readywarning
Wrong state when APSAVE_TAG receiveAPSAVE_TAG received while AP task in unexpected stateAP task receives APSAVE_TAG message during save operationwarning
Wrong state when APSAVE_TAG receiveSDAT received APSAVE_TAG in invalid stateAP sends APSAVE_TAG while SDAT not readywarning
Wrong state when AP_STARTDONE receivedAP_STARTDONE received while array processor in unexpected stateStart done message received out of sequenceerror
Wrong state when BP_NOMOREVIEWS_TAG receivedBP_NOMOREVIEWS_TAG received while task in unexpected stateTask receives no more views tag during operationwarning
Wrong state when BP_NOMOREVIEWS_TAG receivedSDAT received NOMOREVIEWS in invalid stateBP signals no more reviews availablewarning
Wrong state when BP_NOMOREVIEWS_TAG receivedInvalid state for no-more-reviews tag from backplaneDSND receives BP_NOMOREVIEWS_TAG messagewarning
Wrong state when BUFFERREADY receivedInvalid state when buffer-ready message receivedDSND receives BUFFERREADY notificationwarning
Wrong state when END_TAG receivedEND_TAG received while task in unexpected stateEnd tag received out of sequenceerror
Wrong state when INIT_TAG receivedINIT_TAG received while task in unexpected stateInitialization message received out of sequenceerror
Wrong state when MPM_NOMOREVIEWS_TAG receivedMPM_NOMOREVIEWS_TAG received while task in unexpected stateNo more reviews tag received out of sequenceerror
Wrong state when MPM_NOMOREVIEWS_TAG receivedUnexpected state during end-of-views messageMPM_NOMOREVIEWS_TAG received in invalid stateerror
Wrong state when MPM_NOMOREVIEWS_TAG receivedInvalid state for no-more-reviews tag from MPMDSND receives MPM_NOMOREVIEWS_TAG messagewarning
Wrong state when MPM_NOMOREVIEWS_TAG receivedState machine error on receiving end-of-data tagMPM signaled no more reviews in unexpected task stateerror
Wrong state when P_PASS_TAG receivedP_PASS_TAG received while task in unexpected statePass tag received out of sequenceerror
Wrong state when PPLW_CMP_TAG receivedState machine error on completion tag receptionCompletion tag received in unexpected stateerror
Wrong state when PPLW_CMP_TAG receivedPPLW_CMP_TAG received while task in unexpected statePipeline complete tag received out of sequenceerror
Wrong state when RDCAL_TAG receivedUnexpected state during calibration message receiptRDCAL_TAG message received in invalid stateerror
Wrong state when START_PASS_TAG receivedSTART_PASS_TAG received while task in unexpected stateStart pass tag received out of sequenceerror
Wrong state when STARTPROC_TAG receivedSTARTPROC_TAG received while task in unexpected stateStart process message received out of sequenceerror
Wrong state when START_TAG receivedSTART_TAG received while task in unexpected stateStart message received out of sequenceerror
xmit buffer grant errorTransmit buffer grant failedBuffer grant operation unsuccessfulerror
xmit buffer request errorTransmit buffer request failedBuffer request operation failureerror
XOT_ERRX-ray overtime errorX-ray exposure exceeds safe durationerror
X-ray control resetX-ray contactor drops out or system shutdown occursSignal brush block misalignment causing communication loss during operationcritical
XRAYERRX-ray software errorX-ray control software malfunctionerror
XREQERRExposure request errorX-ray exposure request failed or invaliderror
XSC failuresXSC subsystem failureXSC error detected in error logerror

Likely causes and actions for each code are in ServiceForge. Connect ServiceForge to your AI

Community

0 fixes logged by technicians through their AI, with outcomes, for this model.

ServiceForge knowledge base record. Field-unverified unless technicians confirmed it. A teaching summary of the record, not a service manual. Export 2026-10-14.