FR FieldReady Academy
Mammography systems · Senographe family

GE Healthcare Senographe Essential: troubleshooting and error codes

The ServiceForge knowledge base holds 49 documented symptoms for the GE Healthcare Senographe Essential, with 99 ranked causes, 5 diagnostic checks with test points and expected values, and 787 error codes. Each symptom below shows its causes and the first check; the rest is one connection away. Connect ServiceForge to your AI

Symptoms

E10 Heating failure track 1 high voltage

Filament heater track 1 malfunction in X-ray tube

Ranked causes

  1. 1. Heater presence signal high in stand-by (common)
  2. 2. Heater signal stays low when started (common)
  3. 3. Heater signal fails during pre-heater phase (occasional)
  4. 4. Heater signal fails during first trigger (occasional)
  5. 5. Heater signal fails during exposure (occasional)
  6. 6. mA value not significant (occasional)
  7. 7. Heater signal fails after exposure (occasional)
  8. 8. Heater signal stays high when stopped (occasional)

E11 Heating failure track 2 high voltage

Filament heater track 2 malfunction in X-ray tube

Ranked causes

  1. 1. Heater presence signal high in stand-by (common)
  2. 2. Heater signal stays low when started (common)
  3. 3. Heater signal fails during pre-heater phase (occasional)
  4. 4. Heater signal fails during first trigger (occasional)
  5. 5. Heater signal fails during exposure (occasional)
  6. 6. mA value not significant track 2 (occasional)
  7. 7. Heater signal fails after exposure (occasional)
  8. 8. Heater signal stays high when stopped (occasional)

1 corrective action and part numbers are in ServiceForge. Connect ServiceForge to your AI

E03 Rotor failure radiation

X-ray tube anode rotation system malfunction preventing or losing rotation

Ranked causes

  1. 1. Anode rotation signal high in stand-by (common)
  2. 2. Rotation not rising during 9000 rpm acceleration (common)
  3. 3. Rotation not rising during 6000 rpm acceleration (occasional)
  4. 4. Rotation lost at 9000 rpm (common)
  5. 5. Rotation lost at 6000 rpm (occasional)
  6. 6. Rotation lost during deceleration (occasional)
  7. 7. Rotation signal stays high during braking (occasional)

4 corrective actions and part numbers are in ServiceForge. Connect ServiceForge to your AI

E02 Focus bias failure high voltage

Filament bias generation system malfunction in X-ray tube

Ranked causes

  1. 1. Focus bias software error unknown command (rare)
  2. 2. Bias presence signal high in stand-by (occasional)
  3. 3. Bias presence signal stays low when generation starts (occasional)
  4. 4. Bias presence signal goes low after stabilization (occasional)
  5. 5. Bias presence signal stays high after stopping (occasional)

4 corrective actions and part numbers are in ServiceForge. Connect ServiceForge to your AI

IRLOCK motion timeout caution

Locking mechanism does not complete motion within expected time; motor stalls or hangs

Ranked causes

  1. 1. Faulty motor (occasional)
  2. 2. Mechanism blocked by foreign object (occasional)
  3. 3. Faulty motor cable (occasional)
  4. 4. Faulty Breast Support Locking Mechanism Board (occasional)
  5. 5. Faulty power supply (occasional)

1 corrective action and part numbers are in ServiceForge. Connect ServiceForge to your AI

IRLOCK motor malfunction caution

Motor fails to operate or responds abnormally; locking mechanism does not move as expected

Ranked causes

  1. 1. Faulty motor (occasional)
  2. 2. Mechanism blocked by foreign object (occasional)
  3. 3. Faulty motor cable (occasional)
  4. 4. Faulty Breast Support Locking Mechanism Board (occasional)
  5. 5. Faulty power supply or Arm Distribution Board (occasional)

1 corrective action and part numbers are in ServiceForge. Connect ServiceForge to your AI

E04 Arm fatal failure caution

Gantry arm communication or positioning system fatal malfunction

Ranked causes

  1. 1. Boot communication error with gantry (occasional)
  2. 2. Bucky positioning error (occasional)
  3. 3. Gantry error during exposure (occasional)
  4. 4. No gantry acknowledgment to filter change (occasional)

4 corrective actions and part numbers are in ServiceForge. Connect ServiceForge to your AI

IRLOCK release left button timeout caution

Left release button press does not trigger expected response; button input times out

Ranked causes

  1. 1. Right release button faulty (occasional)
  2. 2. Left release button short-circuiting (occasional)
  3. 3. Button connector broken or shorted (occasional)
  4. 4. Button held longer than 1 second (occasional)

1 corrective action and part numbers are in ServiceForge. Connect ServiceForge to your AI

IRLOCK release right button timeout caution

Right release button press does not trigger expected response; button input times out

Ranked causes

  1. 1. Left release button faulty (occasional)
  2. 2. Right release button short-circuiting (occasional)
  3. 3. Button connector broken or shorted (occasional)
  4. 4. Button held longer than 1 second (occasional)

1 corrective action and part numbers are in ServiceForge. Connect ServiceForge to your AI

IR lock/release motion stopped - IR type lost patient safety

Breast support not registered with system via IR code; locking motion halted

Ranked causes

  1. 1. Faulty breast support unit (occasional)
  2. 2. Faulty breast support connection cable W502 (occasional)
  3. 3. Faulty Breast Support Locking Mechanism Board (occasional)

1 corrective action and part numbers are in ServiceForge. Connect ServiceForge to your AI

IR release fork inactive while lock command received caution

Release fork does not respond during lock command; mechanical or electrical fault

Ranked causes

  1. 1. Foreign object blocking optical fork or moving parts (occasional)
  2. 2. Faulty Breast Support Locking Mechanism Board (occasional)
  3. 3. Faulty Breast Support Locking Mechanism (rare)

3 corrective actions and part numbers are in ServiceForge. Connect ServiceForge to your AI

IR type lost and not released patient safety

Breast support not registered via IR code; cannot release mechanism

Ranked causes

  1. 1. Faulty breast support unit (occasional)
  2. 2. Faulty breast support connection cable W502 (occasional)
  3. 3. Faulty Breast Support Locking Mechanism Board (occasional)

1 corrective action and part numbers are in ServiceForge. Connect ServiceForge to your AI

IRLOCK invalid PDO length caution

PDO with invalid DLC received by Breast Support Locking Mechanism Board; data format error

Ranked causes

  1. 1. Faulty Breast Support Locking Mechanism Board (occasional)
  2. 2. Faulty gantry CPU board (occasional)
First check

Replace Breast Support Locking Mechanism Board

Test point
PDO communication
Expected
PDO received with valid DLC

2 corrective actions and part numbers are in ServiceForge. Connect ServiceForge to your AI

Lock optical fork test failed caution

Optical fork on Breast Support Locking Mechanism Board fails lock function test

Ranked causes

  1. 1. Optical fork dirty or obstructed (common)
  2. 2. Faulty Breast Support Locking Mechanism Board (occasional)
First check

Inspect optical fork for cleanliness and obstruction

Test point
Optical fork
Expected
Clean, no foreign objects, moves freely

2 corrective actions and part numbers are in ServiceForge. Connect ServiceForge to your AI

Release optical fork test failed caution

Optical fork on Breast Support Locking Mechanism Board fails self-test at startup

Ranked causes

  1. 1. Optical fork dirty or obstructed (common)
  2. 2. Faulty Breast Support Locking Mechanism Board (occasional)
First check

Inspect optical fork cleanliness

Test point
Optical fork
Expected
Clean, no foreign objects present

2 corrective actions and part numbers are in ServiceForge. Connect ServiceForge to your AI

Compression brake low current patient safety

Halt 122/020: Brake current below acceptable limit; screw or manual compression brake failing.

Ranked causes

  1. 1. Brake power supply failure, wiring break, or brake solenoid malfunction (common)

1 corrective action and part numbers are in ServiceForge. Connect ServiceForge to your AI

Compression button not pressed before motion command

Debug-only error 121/005: CPU sent Start Motion without prior button press command received by node.

Ranked causes

  1. 1. Compression board firmware logic error or synchronization fault (occasional)

3 corrective actions and part numbers are in ServiceForge. Connect ServiceForge to your AI

Compression calibration not achieved patient safety

Warning 121/003: Calibration failed; IPMS ignores all non-calibration commands.

Ranked causes

  1. 1. Compression force or thickness calibration procedure incomplete or failed (common)

2 corrective actions and part numbers are in ServiceForge. Connect ServiceForge to your AI

Compression correlation error caution

Halt 122/005: Absolute coder (potentiometer) and motor encoder (coding wheel) signals not correlated.

Ranked causes

  1. 1. Potentiometer or encoder misalignment, mismatch, or sensor failure (common)

1 corrective action and part numbers are in ServiceForge. Connect ServiceForge to your AI

Compression encoder defect caution

Halt 122/003: Motor encoder signals (A, A bar, B, B bar) show complementarity or sequence error.

Ranked causes

  1. 1. Motor encoder or coding wheel failure or connection issue (common)

1 corrective action and part numbers are in ServiceForge. Connect ServiceForge to your AI

Compression force sensor defect patient safety

Halt 122/021: Force sensor reading outside acceptance range.

Ranked causes

  1. 1. Force sensor failure, excessive reverse force, or signal conditioning problem (common)

2 corrective actions and part numbers are in ServiceForge. Connect ServiceForge to your AI

Compression motion incoherent patient safety

N/A severity 122/004: Encoder pulses detected when no motion expected; occurs on Lift, Rotation, Compression, Tilt.

Ranked causes

  1. 1. Encoder signal spurious or motion control synchronization failure (occasional)

1 corrective action and part numbers are in ServiceForge. Connect ServiceForge to your AI

Compression motor step lost caution

Halt 122/006: Difference detected between commanded and detected steps by absolute encoder.

Ranked causes

  1. 1. Mechanical jam, stalled motor, or encoder slippage at hardpoint (common)

1 corrective action and part numbers are in ServiceForge. Connect ServiceForge to your AI

Compression node firmware incompatibility caution

Halt 122/025: CPLD hardware config, DSP, or MCU firmware mismatch on compression board.

Ranked causes

  1. 1. Firmware or hardware component revision mismatch after board replacement or update (occasional)

3 corrective actions and part numbers are in ServiceForge. Connect ServiceForge to your AI

Compression overcurrent high voltage

Halt 122/008: Integrated current value exceeds limit; current too high for too long.

Ranked causes

  1. 1. Motor stall, mechanical jam, or power stage short circuit on compression board (common)

1 corrective action and part numbers are in ServiceForge. Connect ServiceForge to your AI

Compression overspeed patient safety

Halt 122/007: Measured compression speed exceeds speed profile limits.

Ranked causes

  1. 1. Motor control or speed regulator failure allowing uncontrolled acceleration (occasional)

1 corrective action and part numbers are in ServiceForge. Connect ServiceForge to your AI

Compression potentiometer defect caution

Halt 122/002: Potentiometer signal outside acceptable range at all times.

Ranked causes

  1. 1. Potentiometer sensor failure or electrical connection problem (common)

1 corrective action and part numbers are in ServiceForge. Connect ServiceForge to your AI

Compression software error (invalid parameter)

Debug-only error 121/002: IPMS received command with parameter values outside acceptable range.

Ranked causes

  1. 1. Compression board or firmware parameter validation failure (occasional)

3 corrective actions and part numbers are in ServiceForge. Connect ServiceForge to your AI

Compression software error (simultaneous motion)

Debug-only error 122/024: CPU sent motion command while previous motion not finished.

Ranked causes

  1. 1. Gantry CPU firmware synchronization or timing logic error (occasional)

1 corrective action and part numbers are in ServiceForge. Connect ServiceForge to your AI

Compression software error (unrecognized command)

Debug-only error 121/001: IPMS received unrecognized command identifier from PTB and ignored it.

Ranked causes

  1. 1. Compression board firmware or command compatibility issue (occasional)

3 corrective actions and part numbers are in ServiceForge. Connect ServiceForge to your AI

Compression software watchdog timeout caution

Halt 122/001: Watchdog reset microcontroller after missing 40 ms pulse; node rebooted.

Ranked causes

  1. 1. Microcontroller firmware hang or clock/CPLD issue on compression board (occasional)

3 corrective actions and part numbers are in ServiceForge. Connect ServiceForge to your AI

E01 Generator initialization failure high voltage

Fatal security input detected during generator initialization tests

Ranked causes

  1. 1. Fatal security input triggered during initialization (unknown)

1 corrective action and part numbers are in ServiceForge. Connect ServiceForge to your AI

E08 Power supply failure high voltage

High voltage power supply timeout or regulation failure

Ranked causes

  1. 1. Power supply voltage regulation timeout (common)

1 corrective action and part numbers are in ServiceForge. Connect ServiceForge to your AI

E12 Checksum error caution

Battery-backed memory checksum validation failure

Ranked causes

  1. 1. Battery backup memory corruption (common)

1 corrective action and part numbers are in ServiceForge. Connect ServiceForge to your AI

Emergency stop motion activated patient safety

N/A severity 122/022: Emergency stop button pressed; compression node cuts stop motion line.

Ranked causes

  1. 1. Operator intentionally pressed emergency stop button (common)

3 corrective actions and part numbers are in ServiceForge. Connect ServiceForge to your AI

IR lock/release motion stopped due to button press

Locking or release motion interrupted by user button press; operator error condition

Ranked causes

  1. 1. Operator pressed button during motion (common)

1 corrective action and part numbers are in ServiceForge. Connect ServiceForge to your AI

IR lock/release movement not started caution

Internal motion state machine error; locking mechanism does not respond to commands

Ranked causes

  1. 1. Internal state machine error (rare)

1 corrective action and part numbers are in ServiceForge. Connect ServiceForge to your AI

IRLOCK CAN command not processed caution

CAN command not processed; Gantry CPU sent command before board acknowledged previous command

Ranked causes

  1. 1. Command timing conflict between Gantry CPU and board (rare)

1 corrective action and part numbers are in ServiceForge. Connect ServiceForge to your AI

IRLOCK invalid message caution

Invalid communication between control tasks; locking mechanism command processing error

Ranked causes

  1. 1. Task communication error (rare)

1 corrective action and part numbers are in ServiceForge. Connect ServiceForge to your AI

IRLOCK_CPLD_OPTICAL_FORK_ERROR caution

Hardware error in CPLD affecting optical fork on Breast Support Locking Mechanism Board

Ranked causes

  1. 1. CPLD hardware failure (occasional)

1 corrective action and part numbers are in ServiceForge. Connect ServiceForge to your AI

Left breast support release button still pressed at boot patient safety

System detects left release button state at startup; button may be physically stuck or depressed

Ranked causes

  1. 1. Left release button stuck or physically pressed (common)
First check

Inspect left release button for obstruction

Test point
Release button
Expected
Moves freely without resistance

1 corrective action and part numbers are in ServiceForge. Connect ServiceForge to your AI

Lift down button still pressed

Warning 120/003-004 or Halt 122/011-012: compression node detects lift down button(s) continuously pressed.

Ranked causes

  1. 1. Button contacts stuck or signal timing mismatch (common)

1 corrective action and part numbers are in ServiceForge. Connect ServiceForge to your AI

Lift up button still pressed

Warning 120/001-002 or Halt 122/009-010: compression node detects lift button(s) continuously pressed on keypad.

Ranked causes

  1. 1. Button contacts stuck or debounce failure (common)

1 corrective action and part numbers are in ServiceForge. Connect ServiceForge to your AI

No valid line for compression motion patient safety

Warning 121/004: Gantry CPU requests motion but compression node detects no valid RT line, or valid line falls before movement ends.

Ranked causes

  1. 1. Compression control node defect or invalid line signal lost (common)

1 corrective action and part numbers are in ServiceForge. Connect ServiceForge to your AI

Preset -MLO button still pressed

Warning 120/011 or Halt 122/019: compression node detects Preset -MLO button continuously pressed.

Ranked causes

  1. 1. Button contacts stuck or debounce failure (common)

1 corrective action and part numbers are in ServiceForge. Connect ServiceForge to your AI

Preset +MLO button still pressed

Warning 120/010 or Halt 122/018: compression node detects Preset +MLO button continuously pressed.

Ranked causes

  1. 1. Button contacts stuck or debounce failure (common)

1 corrective action and part numbers are in ServiceForge. Connect ServiceForge to your AI

Preset CC button still pressed

Warning 120/009 or Halt 122/017: compression node detects Preset CC button continuously pressed.

Ranked causes

  1. 1. Button contacts stuck or signal timing mismatch (common)

1 corrective action and part numbers are in ServiceForge. Connect ServiceForge to your AI

Right breast support release button still pressed at boot patient safety

System detects release button state at startup; button may be physically stuck or depressed

Ranked causes

  1. 1. Release button stuck or physically pressed (common)
First check

Inspect right release button for obstruction

Test point
Release button
Expected
Moves freely without resistance

1 corrective action and part numbers are in ServiceForge. Connect ServiceForge to your AI

Rotation button still pressed

Warning 120/005-008 or Halt 122/013-016: compression node detects rotation button(s) continuously pressed.

Ranked causes

  1. 1. Button contacts stuck or debounce failure (common)

1 corrective action and part numbers are in ServiceForge. Connect ServiceForge to your AI

Error codes

CodeMeaningTriggerSeverity
002/001Generator CPU software error: VRTX error during initializationDetected during generator initializationerror
002/002Generator CPU software error: reboot by watchdog hard or reset buttonDetected after CPU hard reset or watchdog rebooterror
002/003Generator CPU software error: reboot by watchdog softDetected after soft watchdog reseterror
002/004Generator CPU: reboot after power micro-failureDetected after power supply micro-interrupterror
003/000Generator CPU software error: bus errorDetected during CPU operationerror
003/001Generator CPU software error: address errorDetected during CPU operationerror
003/002Generator CPU software error: format errorDetected during CPU operationerror
003/003Generator CPU software error: illegal instructionDetected during CPU operationerror
003/004Generator CPU software error: privilege violationDetected during CPU operationerror
003/005Generator CPU software error: trace errorDetected during CPU trace operationwarning
003/006Generator CPU software error: emulation line 1010 errorDetected during CPU operationerror
003/007Generator CPU software error: emulation line 1111 errorDetected during CPU operationerror
003/008Generator CPU software error: CHK errorDetected during CPU operationerror
003/009Generator CPU software error: TRAPV errorDetected during CPU operationerror
004/001Generator interface: reset errorDetected during interface reseterror
004/002Generator interface: read/write error on timer PTM1Detected during PTM1 timer accesserror
004/003Generator interface: read/write error on timer PTM1Detected during PTM1 timer accesserror
004/004Generator interface: read/write error on timer PTM2Detected during PTM2 timer accesserror
004/005Generator interface: read/write error on timer PTM2Detected during PTM2 timer accesserror
004/006Generator interface: interrupt error on DUART1Detected during DUART1 interrupterror
004/007Generator interface: PTM1 timer 1 defectiveDetected during PTM1 timer 1 testerror
004/008Generator interface: PTM1 timer 2 defectiveDetected during PTM1 timer 2 testerror
004/009Generator interface: PTM1 timer 3 defectiveDetected during PTM1 timer 3 testerror
004/010Generator interface: PTM2 timer 1 defectiveDetected during PTM2 timer 1 testerror
004/011Generator interface: PTM2 timer 2 defectiveDetected during PTM2 timer 2 testerror
004/012Generator interface: PTM2 timer 3 defectiveDetected during PTM2 timer 3 testerror
004/013Generator interface: interrupt error on PTM1 timer 1Detected during PTM1 timer 1 interrupterror
004/014Generator interface: interrupt error on PTM1 timer 2Detected during PTM1 timer 2 interrupterror
004/015Generator interface: interrupt error on PTM1 timer 3Detected during PTM1 timer 3 interrupterror
004/016Generator interface: interrupt error on PTM2 timer 1Detected during PTM2 timer 1 interrupterror
004/017Generator interface: interrupt error on PTM2 timer 2Detected during PTM2 timer 2 interrupterror
004/018Generator interface: interrupt error on PTM2 timer 3 D208Detected during PTM2 timer 3 interrupterror
006/000Generator: fault at exposure commandDetected during exposure command initiationcritical
006/001Generator: fault at exposure commandDetected during exposure command initiationcritical
006/002Generator: signal kV_Inf_5 (Less_than_5kV) not risingDetected during exposure ramp-upcritical
006/003Generator: Signal En_Pose (Exposure_On) not risingDetected at exposure startcritical
006/004Generator: fatal security triggered during exposureDetected during active exposurecritical
006/005Generator: fatal security triggered at end of exposure or signal stays highDetected at exposure end or during shutdowncritical
006/011Generator: signal Secu_Rattrap (No_Fatal_Security) stays high after arcing recoveryDetected after arc event recoveryerror
007/xxxE01 Generator failure - one fatal security input active during initDetected during initialization testscritical
011/001Focus bias software error: unknown commandDetected during focus bias operationerror
011/002Focus bias software error: unknown task statusDetected during focus bias task monitoringerror
012/001E02 Focus bias failure - Bias_Presence signal high in stand-byDetected in stand-by modeerror
012/002E02 Focus bias failure - Bias_Presence signal stays low during generationDetected when bias generation startscritical
012/003E02 Focus bias failure - Bias_Presence signal goes low after stabilizationDetected after initial bias stabilizationerror
012/004E02 Focus bias failure - Bias_Presence signal stays high when stoppedDetected after bias generation is commanded to stoperror
016/001Anode starter software error: unknown commandDetected during anode rotation controlerror
016/002Anode starter software error: unknown task statusDetected during anode rotation task monitoringerror
017/001E03 Rotor failure - Rotation_Presence signal high in stand-byDetected in stand-by modeerror
017/002E03 Rotor failure - Rotation signal not rising during 9000 rpm accelerationDetected during rotor spin-up to operating speedcritical
017/003E03 Rotor failure - Rotation signal not rising during 6000 rpm accelerationDetected during initial rotor acceleration phasecritical
017/004E03 Rotor failure - Rotation signal goes low during 9000 rpm operationDetected during normal rotor operation at speedcritical
017/005E03 Rotor failure - Rotation signal goes low during 6000 rpm operationDetected during initial operating phasecritical
017/006E03 Rotor failure - Rotation signal goes low during variable-speed rotationDetected during rotor operation above 6000 rpmcritical
017/007E03 Rotor failure - Rotation signal goes low during low-speed rotationDetected during rotor operation below 6000 rpmerror
017/008E03 Rotor failure - Rotation signal stays high during 9000 rpm brakingDetected during rotor deceleration from full speederror
017/009E03 Rotor failure - Rotation signal stays high during 6000 rpm brakingDetected during rotor deceleration from intermediate speederror
017/010E03 Rotor failure - Rotation signal stays high during rotor failureDetected after rotor failure eventcritical
017/011E03 Rotor failure - Rotation signal stays low during operationDetected during active rotor operationcritical
021/001Heater software error: unknown commandDetected during heater controlerror
021/002Heater software error: unknown task statusDetected during heater task monitoringerror
021/003Heater software error: Heater scaling parameters or values not validDetected during heater initialization or controlerror
022/001E10 Heating failure track 1 - Heater_Presence signal high in stand-byDetected in stand-by modeerror
022/002E10 Heating failure track 1 - Heater signal stays low when startedDetected when heater activation beginscritical
022/003E10 Heating failure track 1 - Heater signal goes low during pre-heater phaseDetected during pre-exposure heater warm-uperror
022/004E10 Heating failure track 1 - Heater signal goes low during first triggerDetected at start of first exposureerror
022/005E10 Heating failure track 1 - Heater signal goes low during exposureDetected during active X-ray exposureerror
022/006E10 Heating failure track 1 - mA value not significantDetected during heater current monitoringerror
022/007E10 Heating failure track 1 - Heater signal goes low after exposureDetected after exposure cessationerror
022/008E10 Heating failure track 1 - Heater signal stays high when stoppedDetected after heater shutdown commanderror
023/001E11 Heating failure track 2 - Heater_Presence signal high in stand-byDetected in stand-by modeerror
023/002E11 Heating failure track 2 - Heater signal stays low when startedDetected when heater activation beginscritical
023/003E11 Heating failure track 2 - Heater signal goes low during pre-heater phaseDetected during pre-exposure heater warm-uperror
023/004E11 Heating failure track 2 - Heater signal goes low during first triggerDetected at start of first exposureerror
023/005E11 Heating failure track 2 - Heater signal goes low during exposureDetected during active X-ray exposureerror
023/006E11 Heating failure track 2 - mA value not significantDetected during heater current monitoringcritical
023/007E11 Heating failure track 2 - Heater signal low after exposureDetected after exposure cessationerror
023/008E11 Heating failure track 2 - Heater signal stays high when stoppedDetected after heater shutdown commanderror
027/003E04 Arm fatal failure - Gantry/optical fiber communication error during bootDetected during system initializationcritical
027/005E04 Arm fatal failure - Gantry error during exposureDetected during active X-ray exposurecritical
027/006E04 Arm fatal failure - Gantry error during exposureDetected during active X-ray exposurecritical
031/001Generator: delay task software error - unknown commandDetected during delay task operationerror
031/002Generator: delay task software error - unknown task statusDetected during delay task monitoringerror
041/001Gene thermal protection software: VRTX errorDetected during thermal protection operationwarning
041/002Gene thermal protection software: VRTX errorDetected during thermal protection operationwarning
041/003Gene thermal protection software: VRTX errorDetected during thermal protection operationwarning
041/004Gene thermal protection software: VRTX errorDetected during thermal protection operationwarning
041/005Gene thermal protection software: unknown anode starter statusDetected during thermal protection monitoringerror
041/006Gene thermal protection software: VRTX errorDetected during thermal protection operationwarning
050/043Unexpected request received in SysCntrlDetected during system control operationerror
052/001E04 Arm fatal failure - No Gantry acknowledgment to filter change requestDetected during collimator filter change operationcritical
056/001Focus software error: ACQ_NTR or ACQ_OVR received or unknown replyDetected during focus control operationerror
056/002Focus software error: unknown commandDetected during focus controlerror
056/003Focus software error: unknown task statusDetected during focus task monitoringerror
057/001Focus: focus change request not transmitted or focus faultDetected during focus adjustment operationerror
061/000Gene to gantry communication driver: no reply from gantry after two attemptsDetected during gantry initialization or communication testcritical
062/000Gene to control panel communication driver: no reply from control panel after two attemptsDetected during control panel initializationcritical
063/006Gene init tests: no gantry status feedback after ten requestsDetected during initialization status pollingcritical
066/000Gene date/time: access timeout during date initializationDetected during system date/time setupwarning
066/001Gene date/time: access timeout during read sequenceDetected during date/time read operationwarning
066/002Gene date/time: access timeout during write sequenceDetected during date/time write operationwarning
066/003Gene date/time: access timeout during time write sequenceDetected during time write operationwarning
067/000Generator: Zero divideDetected during calculation operationerror
068/xxxGenerator: floating point calculation error, xxx is VRTX task numberDetected during floating-point calculationserror
071/081E12 Checksum error (gen) - checksum error on battery saved memoryDetected during battery memory verificationcritical
071/082E08 Power supply failure - timeout on signal Alim_Puis_OK (Inv_Supply_OK)Detected during power supply status monitoringcritical
071/083Generator: error reading 'kV law table' in 0 point technique (AOP)Detected during zero-point technique calibrationerror
072/001Exposure software error: ACQ_NTR or ACQ_OVR received at start of first triggerDetected at start of first exposure pulseerror
072/003Exposure software error: ACQ_NTR or ACQ_OVR received at end of first triggerDetected at end of first exposure pulseerror
072/004Exposure software error: unknown origin of aborted exposureSoftware detected exposure was aborted but origin unknownerror
072/005Exposure software error: aborted by PM in 2 pt techniquePM aborted 2-point exposure techniqueerror
072/006Exposure software error: unknown exposure techniqueSoftware does not recognize the exposure technique being usederror
072/007E06 Software Error (generator CPU)System task not stable after 7s delay during Prep; Senographe component or IDC not readyerror
072/008Exposure software error: unknown task statusSoftware cannot determine status of exposure taskerror
072/009Exposure software error: 0 pt or 1 pt exposure and gantry absentGantry not present for zero or one-point exposureerror
073/001Gene software error (IST, standby): parameter display problemProblem displaying parameters during standby initializationerror
073/002Gene software error (IST, standby): unknown tube typeSystem cannot identify X-ray tube typeerror
073/003Gene software error (IST, standby): alpha=0.0 when calculating P_NDac_HTPMInvalid zero value in calibration calculationerror
073/004Gene software error (IST, standby): incorrect thickness for correlation calculationInvalid thickness value used in correlation calculationerror
073/005Gene software error (IST, standby): bias calibration task problemFailure during bias calibration taskerror
073/006Gene software error (IST, standby): heater scale calibration task problemFailure during heater scale calibrationerror
073/007Gene software error (IST, standby): HV/DAC calibration task problemFailure during high voltage or DAC calibrationerror
073/008Gene software error (IST, standby): FREQ/HV calibration task problemFailure during frequency or HV calibrationerror
073/009Gene software error (IST, standby): PM calibration task problemFailure during PM (sensor) calibrationerror
073/010Gene software error (IST, standby): PM calibration task problemFailure during PM calibrationerror
073/011Gene software error (IST, standby): PM calibration task problemFailure during PM calibrationerror
073/012Gene software error (IST, standby): PM calibration task problemFailure during PM calibrationerror
073/013Gene software error (IST, standby): gantry connection task problemFailure in gantry connection initialization taskerror
073/014Gene software error (IST, standby): gantry connection faultCommunication fault with gantryerror
073/015Gene software error (IST, standby): gantry connection faultCommunication fault with gantryerror
073/016Gene software error (IST, standby): gantry connection faultCommunication fault with gantryerror
073/017Gene software error (IST, standby): mA measurement calibration problemFailure during mA measurement calibrationerror
074/001Gene software error (IST, exposure): unknown exposure endExposure end signal not recognizederror
074/002Gene software error (IST, exposure): unknown gantry replyGantry response not recognized during exposureerror
074/003Gene software error (IST, exposure): unknown gantry replyGantry response not recognized during exposureerror
074/004Gene software error (IST, exposure): unknown exposure statusExposure status unrecognized by softwareerror
075/010Gene software error (MNT): anode starter speed impossibleAnode cannot reach required speederror
075/011Gene software error (MNT): anode starter abnormal test task statusAbnormal status during anode starter testerror
075/020Gene software error (MNT): heater impossible trackHeater cannot track required parameterserror
075/021Gene software error (MNT): heater abnormal test task statusAbnormal status during heater testerror
075/022Gene software error (MNT): heater abnormal test task statusAbnormal status during heater testerror
075/030Gene software error (MNT): bias abnormal test task statusAbnormal status during bias testerror
075/040Gene software error (MNT): HV test abnormal task statusAbnormal status during HV testerror
075/041Gene software error (MNT): gate test abnormal task statusAbnormal status during gate testerror
075/042Gene software error (MNT): inverter test abnormal task statusAbnormal status during inverter testerror
075/050Gene software error (MNT): mA value abnormal test task statusAbnormal status during mA value testerror
075/051Gene software error (MNT): mA measurement abnormal test task statusAbnormal status during mA measurement testerror
075/060Gene software error (MNT): grid sync abnormal test task statusAbnormal status during grid synchronization testerror
075/070Gene software error (MNT): PM test abnormal task statusAbnormal status during PM testerror
075/071Gene software error (MNT): PM test abnormal task statusAbnormal status during PM testerror
075/072Gene software error (MNT): PM test measurement timeoutPM measurement test did not complete in timeerror
075/090Gene software error (MNT): error codes display problemCannot display error codeserror
075/091Gene software error (MNT): error codes display problemCannot display error codeserror
075/092Gene software error (MNT): error codes display problemCannot display error codeserror
075/093Gene software error (MNT): error codes display problemCannot display error codeserror
075/100Gene software error (MNT): transfer frame code errorError in transfer frame codeerror
075/101Gene software error (MNT): transfer abnormal save task statusAbnormal status during data save transfererror
075/102Gene software error (MNT): transfer abnormal save task statusAbnormal status during data save transfererror
075/103Gene software error (MNT): transfer abnormal load task statusAbnormal status during data load transfererror
075/104Gene software error (MNT): transfer abnormal load task statusAbnormal status during data load transfererror
075/105Gene software error (MNT): transfer unknown frameFrame type not recognizederror
075/106Gene software error (MNT): transfer end of loading errorError at end of loading transfererror
075/107Gene software error (MNT): transfer abnormal protocol task statusAbnormal status during protocol transfererror
078/002Gene init tests software error: timeout on system taskSystem task did not complete within timeout perioderror
078/003Gene init tests software error: defective function will self-identifyDefective function detected during initializationerror
078/004Gene init tests software error: defective function will self-identifyDefective function detected during initializationerror
078/005Gene init tests software error: defective function will self-identifyDefective function detected during initializationerror
078/128Gene init tests software error: error following VRTX requestError occurred after VRTX requesterror
079/001Exposure aborted: timeoutExposure did not complete within timeout perioderror
079/002Exposure aborted: heater faultX-ray tube heater malfunction detectederror
079/003Exposure aborted: anode starter faultX-ray tube anode starter malfunctionerror
079/004Exposure aborted: power faultPower supply malfunction detectederror
079/005Exposure aborted: generator faultGenerator system malfunctionerror
079/006Exposure: no gantry acknowledgement or gantry faultGantry not responding at start of first trigger or gantry malfunctionerror
079/008Gantry fault detected before exposure startGantry malfunction detected during boot or exposure requesterror
079/009Exposure: no sync signal from gantry to start exposureGantry synchronization signal not receivederror
079/010Exposure aborted by mA meter (0 pt or 1 pt technique)mA sensor aborted exposureerror
079/011Exposure: no gantry acknowledgement at end of first trigger or gantry faultGantry not responding at end of first trigger or malfunctionerror
079/014E05 Failure during exposureXRayAuthorizedRT signal not received from IDCerror
079/015E05 Failure during exposureBrightness value not received from IDCerror
079/017E16 AWS/SENO Synchro failImage not correctly transferred from IDC to ADSerror
080/001Gene (IST, exposure): heater faultX-ray tube heater malfunction during exposureerror
080/002Gene (IST, exposure): anode starter faultX-ray tube anode starter malfunction during exposureerror
080/003Gene (IST, exposure): power failurePower supply malfunction during exposureerror
080/004Gene (IST, exposure): interface faultInterface malfunction during exposureerror
080/005Gene (IST, exposure): no gantry reply timeoutNo response from gantry within 1 second during exposureerror
080/006Gene (IST, exposure): gantry faultGantry malfunction during exposureerror
080/007Gene (IST, exposure): no gantry reply to exposure commandGantry not responding to exposure commanderror
080/008Gene (IST, exposure): no grid sync feedback after timeoutGrid synchronization feedback not received within timeouterror
082/000Gene: Endurance error codeSystem endurance threshold exceededcritical
082/001Gene: Endurance error codeSystem endurance threshold exceededcritical
082/010Gene: Endurance error codeSystem endurance threshold exceededcritical
082/020Gene: Endurance error codeSystem endurance threshold exceededcritical
082/030Gene: Endurance error codeSystem endurance threshold exceededcritical
082/040Gene: Endurance error codeSystem endurance threshold exceededcritical
083/002I17 AWS/SENO Comm. lostSenographe/AWS communication failure for 2 minuteserror
084/008E24 Failure before exposureSignal not correctly received from IDC or Gantry after radiography key pressed but before X-ray emissionerror
084/009E24 Failure before exposureSignal not correctly received from IDC or Gantry after radiography key pressed but before X-ray emissionerror
084/013E24 Failure before exposureSignal not correctly received from IDC or Gantry after radiography key pressed but before X-ray emissionerror
090/000Generator: PROM checksum errorPROM memory checksum validation failederror
092/000 (E19)E19 IDC/Seno down, DPS is offNo answer from IDC for 2 minutes; connection lost; detector power supply shut downerror
092/000 (I19)I19 IDC/Seno comm. lostNo answer from IDC for 15 seconds; connection losterror
094/001E18 IDC/Seno synchro failureBad command received by IDC task; error in signal/messageerror
094/002E18 IDC/Seno synchro failurePrep command not received by IDC taskerror
094/003E18 IDC/Seno synchro failureStop command at end of exposure not received by IDC taskerror
094/004E18 IDC/Seno synchro failureXRayAuthorizedRT status not received by IDC taskerror
094/005E18 IDC/Seno synchro failureStop command not received by IDC task at end of radiographyerror
094/006E18 IDC/Seno synchro failurePrep command not received by exposure automaton task T_APPLIerror
094/007E18 IDC/Seno synchro failureXRayAuthorizedRT signal active in idle statuserror
096/019I34 Thickness out of AOP rangeMeasured breast thickness outside AOP rangewarning
096/020I36 IFF threshold out of rangeIFF (IDC algorithm) threshold outside acceptable rangewarning
096/021I37 9 param model deviateError on Scf factor for pre-exposure; corrected mechanical thickness zero or breast composition 0.6-1.4 range violationwarning
096/023I05 Exposure aborted by mAs levelmAs value for pre-exposure outside acceptable rangewarning
096/024I06 Abort: Detect sig. out rangeDose value returned by IDC outside acceptable rangewarning
096/025Track/filter changeTrack/filter configuration changed between pre-shot and exposure phasesinfo
096/033Invalid dose value from IDCIDC sent an invalid dose value to Senographe systemwarning
096/038Image signal too lowImage signal below acceptable range in AOP mode between pre-exposure and exposure; dose out of permitted rangeerror
096/039Image signal too highImage signal above acceptable range in AOP mode between pre-exposure and exposure; dose out of permitted rangeerror
096/040No AOP zone establishedExposure aborted; automatic optimization protocol (AOP) zone not establishederror
096/041Thermal limit: mAs not optimalSystem thermal condition reached; exposure mAs value reduced to maintain image quality limitswarning
096/042Exposure time limit: mAs not optimalExposure time limit reached; mAs reduced within image quality limitswarning
096/043Exposure time limit: mAs too lowMaximum exposure time reached; mAs reduced below regular image quality limitswarning
097/026U-turn before end of pre-shotPre-shot exposure time exceeds grid motion duration to first turn-back pointinfo
097/027U-turn before end of exposureExposure time in manual or AOP mode exceeds grid motion duration to first turn-back pointinfo
100/001Lift hardware errorRelay defect at power-up; relay shorted, preventing H-bridge voltage verificationcritical
100/001Lift hardware relay defect detected at power-upRelay mounted parallel to motor H-bridge fails continuity/short test during power-up initializationcritical
100/002Upper optical fork sensor failureAt power-up, LED shutdown does not cause photoresistor to shut down, indicating optical fork failurecritical
100/003Lower optical fork sensor failureAt power-up, LED shutdown does not cause photoresistor to shut down, indicating optical fork failurecritical
100/004Footswitch is pressed during bootLift up, lift down, compression up, or compression down button pressed during node boot-upwarning
100/005Footswitch is pressed during bootCompression or lift button pressed during node boot-upwarning
100/006Footswitch is pressed during bootButton pressed during node boot-upwarning
100/007Footswitch is pressed during bootButton pressed during node boot-upwarning
100/009Lift over upper software limitLift position not between software limits at power-up, or lift moved manually to upper positioncritical
100/010Lift below lower software limitLift position not between software limits at power-up, or lift moved manually to lower positioncritical
100/011Gantry display failureLCD failure detectederror
101/001Lift software error - unrecognized commandPTB sends command not in IPMS recognized command listinfo
101/002Lift software error - parameter range violationPTB sends command with parameter values outside valid rangeinfo
101/003Lift calibration not achievedLift calibration incomplete or failedwarning
101/004No valid line for liftGantry CPU requests motion but node does not see valid line; valid line falls before motion enderror
101/005Keyboard failure - lift motionCPU sends Start Motion command without preceding CAN command from node; 100ms timeout expiresinfo
102/000Lift software error - watchdog resetWatchdog timer detects microcontroller failure; no pulse received for 40mscritical
102/001Lift position error - potentiometer defectPotentiometer signal outside acceptable range at power-up or during operationcritical
102/002Lift speed error - encoder defectCoding wheel defect detected through complemented hardware linescritical
102/005Uncontrolled lift motion - correlation errorAbsolute coder (potentiometer) and coding wheel (encoder) signals not correlatedcritical
102/006Lift footswitch defectTwo signals from button do not arrive at same time on CPLDcritical
102/007Lift footswitch defectTwo signals from button do not arrive at same timecritical
102/008Compression footswitch defectTwo signals from button do not arrive at same timecritical
102/009Compression footswitch defectTwo signals from button do not arrive at same timecritical
102/010Lift over upper limitLift motion reaches upper electrical stop limitcritical
102/012Lift over lower limitLift motion reaches lower electrical stop limitcritical
102/013Lift overspeedLift speed measured by encoder exceeds speed profile limitcritical
102/014Lift lowspeed warningLift speed measured by encoder below speed profile limitwarning
102/015Lift over-currentIntegrated current value too high; current elevated for too longcritical
102/016Movement already in progressCPU sends motion command while node performing another movementinfo
102/017Lift node firmware incompatibilityHardware configuration (CPLD), DSP, or MCU firmware does not matchcritical
102/018Lift node parity errorParity bit incorrect on on-board bus between CPLD and MCUcritical
102/019Stop line activated due to uncontrolled motionSame as error 102/004 - uncontrolled motion detectedcritical
102/020Stop line activated by CPUMain CPU detected error and activated or failed to deactivate stop motion lineerror
102/021Low voltage error on liftPower supply voltage falls below 24Vcritical
102/022Lift read time-out errorMCU has not reacted on interrupt request (IRQ) from CPLD before 15mscritical
102/023Lift CPLD memory errorCPLD test data does not match periodic read; communication failure detectedcritical
102/024Uncontrolled lift motion detected; stop line activatedMotion performed when lift node should not drive; MCU_STOP_MOTION activatedcritical
102/025Lift relative encoder errorSignal from relative encoder does not evolve during motion; absolute encoder signals differcritical
102/027Lift MCU calibration data corruptChecksum on MCU calibration data does not matchwarning
102/028Lift DSP calibration data corruptChecksum on DSP calibration data does not matchwarning
102/029Lift MCU EEPROM failureReadback of newly written data to EEPROM failscritical
102/030Lift position errorMotion did not stop at target/limit position; exceeded allowed marginunknown
102/031Lift deceleration errorMotion began to slow down but did not stop before allowed timewarning
102/032Lift motion started in reverse directionMotion about to proceed in reverse of requested directioncritical
102/033Lift DSP timeoutLift DSP did not answer MCU before timeoutcritical
102/034Lift CAN command not processedGantry CPU sent command before lift node acknowledged previous commandwarning
102/035Lift RX CAN buffer overrunInput queue of incoming CAN messages of MCU is full; message droppedcritical
102/036Lift TX CAN buffer overrunTransmit queue full or TP1 connector jumper closedcritical
102/037Lift mailbox overrunInter-task communication mailbox queue in MCU is full; messages droppedcritical
102/038CPU heartbeat not received by Lift nodeGantry CPU did not send periodic heartbeat CAN messagecritical
102/039Heartbeat disabled on Lift nodeGantry CPU attempted to disable heartbeat check of lift nodeunknown
102/04Lift low-speed error - encoder phase sequenceMotor encoder signal phase or complementarity check failscritical
102/040Lift invalid PDO lengthPDO with invalid DLC received by lift nodecritical
102/041Valid line active on Lift node at power-upValid motion line is active at power-upwarning
102/042Lift stopped without stop commandLift node stopped motion by itself when button/pedal released before timeoutwarning
102/043Lift invalid brake defect errorBrake malfunction detected (should not occur)unknown
102/044Lift invalid clutch malfunction errorClutch malfunction detected (should not occur)unknown
102/045Lift invalid user interface errorUser interface function errorcritical
102/046Lift invalid collimator button errorCollimator button malfunctionunknown
102/047Lift invalid initialization errorInitialization error (should not occur)unknown
102/048Lift invalid force sensor defect errorForce sensor defect detected (should not occur)unknown
102/049Lift invalid force sensor range errorForce sensor range error detected (should not occur)unknown
102/050Lift H-Bridge voltage errorH-Bridge voltage supply faultcritical
102/051Lift unexpected event errorSoftware error or unexpected condition detectedcritical
102/052Lift invalid go rotation failure errorRotation command failureunknown
102/053Lift invalid go angulation failure errorAngulation command failureunknown
103/001Lift end position reached (upper limit)Start motion command when upper stop limit already activeinfo
103/002Lift end position reached (lower limit)Start motion command when lower stop limit already activeinfo
110/001Rotation relay defect at power-upAt system power-up, relay check fails (relay does not create short-cut of H-bridge or does not re-open properly)critical
110/006Arm turned right too farArm position exceeds software upper limit at power-up (including tolerance)critical
110/007Arm turned left too farArm position exceeds software lower limit at power-up (including tolerance)critical
111/001Rotation software error - unrecognized command identifierCommand sent by PTB is not recognized by IPMSinfo
111/002Rotation software error - parameter out of rangeCommand parameter values incompatible with range when PTB sends command to IPMSinfo
111/003Rotation calibration not achievedCalibration not completed; IPMS receives non-calibration CAN commandwarning
111/004No valid line for rotationValid real-time (RT) line not detected during motion command or falls before motion completeswarning
111/005Rotation button not pressedCAN signal indicating rotation button press not received by rotation nodeinfo
112/000Rotation software error - watchdog resetWatchdog does not receive pulse from microcontroller every 40 ms; microcontroller resetscritical
112/001Rotation potentiometer defectSignal from potentiometer out of acceptable rangecritical
112/002Rotation encoder defectMotor encoder signal phases (A, A complementary, B, B complementary) fail complementarity or sequence checkcritical
112/004Rotation motion uncoherentPulses received from coder when IPMS expects no motion (also applies to Lift, Compression, Tilt)warning
112/005Rotation correlation errorSignals from absolute coder (potentiometer) and coding wheel (motor encoder) not correlatedcritical
112/008Rotation brake defectBrake current <1.5 A when released or too high when operatingcritical
112/010Rotation hardware limit reachedIPMS detects motion reaching electrical stop limitcritical
112/011Rotation overspeedSpeed measured by encoder exceeds speed profile limit (correlation OK)critical
112/012Rotation low speedSpeed measured by encoder too low relative to speed profile (correlation OK)warning
112/014Rotation overcurrentIntegrated current value too high over sustained periodcritical
112/015Rotation software error - overlapping movement commandsGantry CPU sends movement command while another movement still in progressinfo
112/016Rotation node firmware incompatibilityHardware configuration (CPLD), DSP, or MCU firmware do not matchcritical
112/017Rotation node parity errorParity bit error on on-board bus between CPLD and MCUcritical
112/018Stop line activated due to uncontrolled rotation motionUncontrolled motion detected by DSP; MCU_STOP_MOTION line activatedcritical
112/019Stop line activated by CPUStop motion line active; CPU detected error or failed to deactivate linecritical
112/020Low voltage error on rotation nodePower supply voltage to rotation board drops below 24 Vcritical
112/021Rotation read timeout errorMCU does not respond within 15 ms of receiving interrupt request (IRQ) from CPLDcritical
112/022Rotation CPLD memory errorCPLD test data read during periodic check does not match expected valuecritical
112/023Uncontrolled rotation motion detected; stop line activatedMotion occurs when rotation node not driving it; uncontrolled motion detectedcritical
112/024Rotation relative encoder errorRelative encoder signal does not evolve during rotation motion while absolute encoder signal doescritical
112/026Rotation MCU calibration data corruptChecksum on calibration data stored in MCU does not matchwarning
112/027Rotation DSP calibration data corruptDSP checksum on stored calibration data does not matchwarning
112/028Rotation MCU EEPROM failureReadback on newly written data to EEPROM has failedcritical
112/029Rotation position errorRotation motion did not stop at target/limit position and exceeded allowed marginwarning
112/030Rotation deceleration errorRotation motion began to slow down but did not stop before allowed timewarning
112/031Rotation motion started in reverse directionRotation motion about to go in reverse direction to requested directioncritical
112/032Rotation DSP timeoutDSP did not answer to MCU before timeoutcritical
112/033Rotation CAN command not processedCAN command not processed; main CPU sent command before rotation node acknowledged previous commandwarning
112/034Rotation RX CAN buffer overrunInput queue of incoming CAN messages of MCU is full and message dropped, or TP1 connector on Rotation board is closedcritical
112/035Rotation TX CAN buffer overrunTransmit queue between MCU and DSP is full and message droppedcritical
112/036Rotation mailbox overrunMailbox queue used in inter-task communication in MCU is full and mails droppedcritical
112/037CPU heartbeat not received by rotation nodeGantry CPU did not send periodic heartbeat CAN messagecritical
112/038Heartbeat disabled on rotation nodeGantry CPU tried to disable heartbeat check of rotation nodewarning
112/039Rotation invalid PDO lengthPDO with invalid DLC received by rotation nodecritical
112/040Valid line active on rotation nodeValid motion line is active at power-upwarning
112/041Rotation stopped without stop commandRotation node stopped motion by itself because button/pedal released and no stop order received before timeoutwarning
112/042Rotation node switch to angulation mode failedRotation node failed to switch to angulation modewarning
112/043Rotation node switch to rotation mode failedRotation node failed to switch to rotation modewarning
112/044Angulation clutch not readyAt power-up, rotation node checks for no current through clutch. Error occurs if multiple angulations in less than 300msec, no current at power-on, or clutch stays lockedwarning
112/045Rotation optical fork defectAt power-up, LED of left optical fork shuts down but photoresistor does not shut downcritical
112/046Rotation invalid user interface errorUser interface communication or command error detectedinfo
112/047Rotation invalid lift up slow button errorLift up slow button interface error detectedinfo
112/048Rotation invalid up fast button errorUp fast button interface error detectedinfo
112/049Rotation invalid lift down slow errorLift down slow button interface error detectedinfo
112/050Rotation invalid lift down fast button errorLift down fast button interface error detectedinfo
112/051Rotation invalid rot left slow button errorRotate left slow button interface error detectedinfo
112/052Rotation invalid rot left fast button errorRotate left fast button interface error detectedinfo
112/053Rotation invalid rot right slow button errorRotate right slow button interface error detectedinfo
112/054Rotation invalid rot right fast button errorRotate right fast button interface error detectedinfo
112/055Rotation invalid MLO left button errorMLO left button interface error detectedinfo
112/056Rotation invalid MLO right button errorMLO right button interface error detectedinfo
112/057Rotation invalid CC button errorCC button interface error detectedinfo
112/058Rotation invalid collimator button errorCollimator button interface error detectedinfo
112/059Rotation invalid initialization errorInitialization sequence error detectedinfo
112/060Rotation invalid step lost errorMotor step loss detected during operationinfo
112/061Rotation invalid force sensor defectForce sensor hardware failure detectedinfo
112/062Rotation invalid command errorInvalid command received or processing errorinfo
112/063Rotation invalid force sensor range errorForce sensor reading exceeds valid rangeinfo
112/064Rotation invalid SW errorInvalid software error detectedcritical
112/065Rotation invalid internal SW errorInternal software error detectedcritical
112/066Rotation invalid lift down pedal press errorLift down pedal is depressedinfo
112/067Rotation invalid lift up pedal press errorLift up pedal is depressedinfo
112/068Rotation invalid compression pedal press errorCompression pedal is depressedinfo
112/069Rotation invalid decompression pedal press errorLift Up button on Compression Arm or Tube Head is depressedinfo
112/070Rotation invalid lift up slow button press errorLift Up button on Compression Arm or Tube Head is depressedinfo
112/071Rotation invalid lift up fast button press errorDown Lift button on Compression Arm or Tube Head is depressedinfo
112/072Rotation invalid lift down slow button errorDown Lift button on Compression Arm or Tube Head is depressedinfo
112/073Rotation invalid lift down fast button press errorLeft Rotation button on Compression Arm or Tube Head is depressedinfo
112/074Rotation invalid rot left slow button press errorLeft Rotation button on Compression Arm or Tube Head is depressedinfo
112/075Rotation invalid rot left fast button press errorLeft Rotation button on Compression Arm or Tube Head is depressedinfo
112/076Rotation invalid rot right slow button press errorRight Rotation button on Compression Arm or Tube Head is depressedinfo
112/077Right rotation button depressedRight Rotation button on Compression Arm or Tube Head is pressedinfo
112/078MLO Left button depressedMLO Left button on Compression Arm or Tube Head is pressedinfo
112/079MLO Right button depressedMLO Right button on Compression Arm or Tube Head is pressedinfo
112/080CC button depressedCC button on Compression Arm or Tube Head is pressedinfo
112/081Collimator button depressedCollimator button is pressedinfo
113/001Rotation end position reachedStartMotion command when software stop limit already reached for rotation directionwarning
113/002Rotation end position reachedStartMotion command when software stop limit already reached for rotation directionwarning
113/003Angulation limit reachedStartMotion command when software stop limit already reached for angulation direction (+45° or -45°)warning
113/004Angulation limit reachedStartMotion command when software stop limit already reached for angulation directionwarning
120/001Lift up button still pressedCompression keypad lift up button (V1 or V2) continuously detected pressedwarning
120/002Lift up button still pressedCompression keypad lift up button continuously detected pressedwarning
120/003Lift down button still pressedCompression keypad lift down button continuously detected pressedwarning
120/004Lift down button still pressedCompression keypad lift down button continuously detected pressedwarning
120/005Rotation button still pressedCompression keypad rotation button continuously detected pressedwarning
120/006Rotation button still pressedCompression keypad rotation button continuously detected pressedwarning
120/007Rotation button still pressedCompression keypad rotation button continuously detected pressedwarning
120/008Rotation button still pressedCompression keypad rotation button continuously detected pressedwarning
120/009CC preset button still pressedCompression keypad preset CC button continuously detected pressedwarning
120/010Preset +MLO button still pressedCompression keypad preset +MLO button continuously detected pressedwarning
120/011Preset -MLO button still pressedCompression keypad preset -MLO button continuously detected pressedwarning
121/001Compression software error - unrecognized commandPTB sent command identifier not in IPMS recognized command listerror
121/002Compression software error - invalid parameterCommand parameter values outside acceptable range for IPMS processingerror
121/003Compression calibration not achievedCalibration procedure incomplete or failed; system in non-calibrated statewarning
121/004No valid line for compression motionGantry CPU requests compression motion but CPLD valid line signal absent or drops before completionwarning
121/005Compression button not pressed before motionGantry CPU sent Start Motion command before node received any prior button press on CANerror
122/000CPU heartbeat not received by compression nodeMain CPU did not send periodic heartbeat CAN messagecritical
122/001Compression software watchdog timeoutWatchdog did not receive 40 ms pulse from microcontroller; microcontroller reset and node rebootedcritical
122/002Compression potentiometer defectPotentiometer signal continuously outside acceptable range during operationcritical
122/003Compression encoder defectMotor encoder (coding wheel) signals fail complementarity or phase sequence check on CPLDcritical
122/004Compression motion incoherentEncoder pulses detected during movement when no motion commanded by CPU (Lift/Rotation/Compression/Tilt)unknown
122/005Compression correlation errorAbsolute coder (potentiometer) and motor encoder (coding wheel) signals not synchronizedcritical
122/006Compression motor step lostDifference between commanded steps and absolute encoder detected steps exceeds thresholdcritical
122/007Compression overspeedMeasured compression speed exceeds speed profile limits during controlled motioncritical
122/008Compression overcurrentIntegrated motor current value exceeds acceptable limit; current excessive for extended durationcritical
122/009Lift up button switch defect (Halt)2 signals from lift up button do not arrive simultaneously on CPLD during button presscritical
122/010Lift up button switch defect (Halt)2 signals from lift up button do not arrive simultaneously on CPLDcritical
122/011Lift down button switch defect (Halt)2 signals from lift down button do not arrive simultaneously on CPLD during presscritical
122/012Lift down button switch defect (Halt)2 signals from lift down button do not arrive simultaneously on CPLDcritical
122/013Rotation button switch defect (Halt)2 signals from rotation button do not arrive simultaneously on CPLD during presscritical
122/014Rotation button switch defect (Halt)2 signals from rotation button do not arrive simultaneously on CPLDcritical
122/015Rotation button switch defect (Halt)2 signals from rotation button do not arrive simultaneously on CPLD during presscritical
122/016Rotation button switch defect (Halt)2 signals from rotation button do not arrive simultaneously on CPLDcritical
122/017CC preset button switch defect (Halt)2 signals from preset CC button do not arrive simultaneously on CPLD during presscritical
122/018Preset +MLO button switch defect (Halt)2 signals from preset +MLO button do not arrive simultaneously on CPLD during presscritical
122/019Preset -MLO button switch defect (Halt)2 signals from preset -MLO button do not arrive simultaneously on CPLD during presscritical
122/020Compression brake low currentCurrent supplied to compression brakes (screw brake and manual brake) falls below acceptable limitcritical
122/021Compression force sensor defectForce sensor reading outside acceptable operating range during compression operationcritical
122/022Emergency stop motion activatedOperator pressed emergency stop button on system; compression node cuts stop motion lineunknown
122/024Compression software error - simultaneous motionGantry CPU sent second motion command before previous motion completed on same nodeerror
122/025Compression node firmware incompatibilityHardware configuration (CPLD), DSP firmware, or MCU firmware version mismatch detected on startupcritical
122/026Node parity errorParity bit does not set correctly on onboard bus between CPLD and MCUcritical
122/027Stop line activated by CPU without deactivationMain CPU detected error and activated or failed to deactivate stop motion lineinfo
122/028Low voltage error on compression nodePower supply voltage falls below 24Vcritical
122/029Compression read timeout errorMCU does not react on IRQ from CPLD before 15mscritical
122/030Compression CPLD memory errorTest data from CPLD periodically read does not match expected valuescritical
122/031Compression relative encoder errorRelative encoder signal does not evolve during motion while absolute encoder signal doescritical
122/033Compression command sequence incorrectSignal command sequence wrong; incorrect signal sequence to start motorcritical
122/034Compression MCU calibration data corruptChecksum on calibration data stored by MCU does not matchwarning
122/035Compression MCU EEPROM failureReadback of newly written data to EEPROM failscritical
122/036Compression CAN command not processedMain CPU sends command before compression node acknowledges previous commandwarning
122/037Compression CAN buffer overrunInput queue of incoming CAN messages full; message droppedcritical
122/038Compression mailbox overrunMailbox queue for inter-task communication in MCU full; mails droppedcritical
122/039Heartbeat disabled on compression node (debug only)Main CPU tried to disable heartbeat check of compression nodeinfo
122/040Compression invalid PDO lengthProcess Data Object length outside specificationcritical
122/041Valid line active on compression node at power-upValid motion line is active during system startupwarning
122/042Compression stopped without stop commandCompression node stopped motion after button/pedal released; no stop order received before timeoutwarning
122/043Compression force sensor failureNo frequency signal detected from compression force sensorcritical
122/044Compression invalid RX_OPTICAL_FORK1 error (debug only)Optical fork receiver 1 communication errorinfo
122/045Compression invalid RX_OPTICAL_FORK2 error (debug only)Optical fork receiver 2 communication errorinfo
122/046Compression invalid lift down pedal error (debug only)Lift down pedal sensor communication errorinfo
122/047Compression invalid lift up pedal error (debug only)Lift up pedal sensor communication errorinfo
122/048Compression invalid compression pedal error (debug only)Compression pedal sensor communication errorinfo
122/049Compression invalid decompression pedal error (debug only)Decompression pedal sensor communication errorinfo
122/050Compression invalid stop motion DSP active (debug only)Stop motion digital signal processor active during operationinfo
122/051Compression invalid clutch malfunction (debug only)Clutch control communication errorinfo
122/052Compression invalid user interface error (debug only)User interface communication errorinfo
122/053Compression invalid collimator button error (debug only)Collimator button communication errorinfo
122/054Compression invalid relay errorRelay control communication failurecritical
122/055Compression invalid upper optical fork reached (debug only)Upper optical fork limit sensor triggeredinfo
122/056Compression invalid lower optical fork reached (debug only)Lower optical fork limit sensor triggeredinfo
122/057Compression invalid initialization error (debug only)Node initialization failureinfo
122/058Compression invalid uncontrolled motion (debug only)Motion control failure detectedinfo
122/059Compression invalid software errorSoftware execution or logic failure in compression nodecritical
122/060Compression invalid go rotation failure (debug only)Rotation command execution failureinfo
122/061Compression invalid go angulation failure (debug only)Angulation command execution failureinfo
122/062Compression invalid underspeed error (debug only)Motor speed below expected thresholdinfo
122/063Compression invalid position error (debug only)Position feedback mismatchinfo
122/064Compression invalid deceleration error (debug only)Deceleration profile failureinfo
122/065Compression invalid movement reverse direction (debug only)Motion direction opposite to commandedinfo
122/066Compression invalid internal software errorInternal software execution failurecritical
122/067Compression invalid DSP timeout elapsed (debug only)Digital signal processor response timeoutinfo
122/068Compression invalid transmit queue full (debug only)CAN transmit message queue exceededinfo
122/069Compression invalid lift down pedal press (debug only)Occurs when lift down pedal is depressedinfo
122/070Compression invalid lift up pedal press (debug only)Occurs when lift up pedal is depressedinfo
122/071Invalid compression pedal pressCompression pedal is depressedinfo
122/072Invalid decompression pedal pressDecompression pedal is depressedinfo
122/073Invalid collimator button pressCollimator button is depressedinfo
123/001Maximum compression force already reachedOperator presses compression footswitch when max force is reachedwarning
123/002Compression upper position already reachedOperator presses decompression footswitch when upper limit is reachedwarning
123/003Compression lower position already reachedOperator presses compression footswitch when lower limit is reachedwarning
123/004Negative force limit reachedDecompression motion ongoing or requested when negative force limit (-3daN) reachedwarning
130/001UIF Still pressedOne of the 9 buttons on the Compression Arm or Tube Head is still pressed (Lift up, Lift down, Rotation Right, Rotation Left, Light/Field Of View)warning
130/002UIF Still pressedOne of the 9 buttons on the Compression Arm or Tube Head is still pressedwarning
130/003UIF Still pressedOne of the 9 buttons on the Compression Arm or Tube Head is still pressedwarning
130/004UIF Still pressedOne of the 9 buttons on the Compression Arm or Tube Head is still pressedwarning
130/005UIF Still pressedOne of the 9 buttons on the Compression Arm or Tube Head is still pressedwarning
130/006UIF Still pressedOne of the 9 buttons on the Compression Arm or Tube Head is still pressedwarning
130/007UIF Still pressedOne of the 9 buttons on the Compression Arm or Tube Head is still pressedwarning
130/008UIF Still pressedOne of the 9 buttons on the Compression Arm or Tube Head is still pressedwarning
130/010Tube Tilt initialization failureAt power-up, optical fork shut state mismatch or Tube Tilt motion does not reach expected transition after correct number of stepserror
130/011UIF Still pressedOne of the 9 buttons on the Compression Arm or Tube Head is still pressedwarning
130/012UIF Still pressedOne of the 9 buttons on the Compression Arm or Tube Head is still pressedwarning
130/013UIF Still pressedOne of the 9 buttons on the Compression Arm or Tube Head is still pressedwarning
130/014UIF Still pressedOne of the 9 buttons on the Compression Arm or Tube Head is still pressedwarning
131/001Tube Tilt software errorCorrupt software/firmware on the Tube Tilt boarderror
131/002Tube Tilt software errorCorrupt software/firmware on the Tube Tilt boarderror
131/003Tube Tilt calibration not achievedTube Tilt board has not been calibrated or has lost calibration settingserror
132/000Tilt Invalid PDO lengthInvalid protocol data unit length from Tube Tilt boarderror
132/001Tube Tilt software errorCorrupt software/firmware on the Tube Tilt board linked to FW problemerror
132/002Tube Tilt fan errorFan rotation speed not within acceptable range as monitored by third wirewarning
132/003Tube Tilt switch defectTwo signals from button do not arrive at the same time on the CPLDcritical
132/004Tube Tilt switch defectTwo signals from button do not arrive at the same time on the CPLDcritical
132/005Tube Tilt switch defectTwo signals from button do not arrive at the same time on the CPLDcritical
132/006Tube Tilt switch defectTwo signals from button do not arrive at the same time on the CPLDcritical
132/007Tube Tilt switch defectTwo signals from button do not arrive at the same time on the CPLDcritical
132/008Tube Tilt switch defectTwo signals from button do not arrive at the same time on the CPLDcritical
132/009Tube Tilt switch defectTwo signals from button do not arrive at the same time on the CPLDcritical
132/010Tube Tilt switch defectTwo signals from button do not arrive at the same time on the CPLDcritical
132/012Tube Tilt step lostTube Tilt does not reach transition after expected number of stepserror
132/013Tilt Node FW incompatibilityHardware configuration (CPLD) or DSP/MCU firmware mismatcherror
132/014Tilt Node parity errorParity bit error on on-board bus between CPLD and MCUerror
132/015Low voltage error on Tilt NodeVoltage to Tube Tilt board falls below 24Verror
132/016Tilt read timeout errorMCU does not react within 15ms of receiving interrupt request from CPLDerror
132/017Tilt CPLD memory errorPeriodic test data from CPLD does not match on readerror
132/018Tilt command sequence incorrectChecksum on calibration data stored by MCU does not matcherror
132/019Tilt MCU calibration data corruptChecksum on calibration data stored by MCU does not matcherror
132/020Tilt MCU EEPROM failureReadback of newly written EEPROM data failederror
132/021Tilt CAN command not processedGantry CPU sent command before compression node acknowledged previous commanderror
132/022Tilt CAN buffer overrunInput queue of incoming CAN messages full and message droppederror
132/023Tilt mailbox overrunMailbox queue for inter-task communication in MCU is full and mails droppederror
132/024Heartbeat disabled on Tilt NodeGantry CPU tried to disable the heartbeat check of the tilt nodeinfo
132/025Tube Tilt switch defectTwo signals from button do not arrive at the same time on the CPLDcritical
132/026Tube Tilt switch defectTwo signals from button do not arrive at the same time on the CPLDcritical
132/027Tube Tilt switch defectTwo signals from button do not arrive at the same time on the CPLDcritical
132/028Tilt overcurrentMotion over current detectederror
132/029CPU heartbeat not received by Tilt NodeGantry CPU did not send periodic heartbeat CAN messageerror
132/030Tilt invalid RX_OPTICAL_FORK1_ERRORInvalid optical fork sensor 1 signal receivedinfo
132/031Tilt invalid RX_OPTICAL_FORK2_ERRORInvalid optical fork sensor 2 signal receivedinfo
132/032Tilt invalid LIFT_DOWN_PEDAL_ERRORInvalid lift down pedal signalinfo
132/033Tilt invalid LIFT_UP_PEDAL_ERRORInvalid lift up pedal signalinfo
132/034Tilt invalid COMPRESSION_PEDAL_ERRORInvalid compression pedal signalinfo
132/035Tilt invalid DECOMPRESSION_PEDAL_ERRORInvalid decompression pedal signalinfo
132/036Tilt invalid STOP_MOTION_MCU_ACTIVE_ERRORMCU stop motion signal invalid or inactive when expectedinfo
132/037Tilt invalid STOP_MOTION_DSP_ACTIVE_ERRORDSP stop motion signal invalid or inactive when expectedinfo
132/038Tilt invalid STOP_MOTION_LINE_ACTIVE_ERRORStop motion line signal invalidinfo
132/039Tilt invalid BRAKE_MALFUNCTION_ERRORBrake system malfunction detectedinfo
132/040Tilt invalid CLUTCH_MALFUNCTION_ERRORClutch system malfunction detectedinfo
132/041Tilt invalid CODER_SEQUENCE_ERROREncoder signal sequence errorinfo
132/042Tilt invalid CODER_SIGNAL_ERROREncoder signal invalidinfo
132/043Tilt invalid USERINTERFACE_ERRORUser interface signal probleminfo
132/044Tilt invalid COLLIMATOR_BUTTON_ERRORCollimator button signal invalidinfo
132/045Tilt invalid RELAY_ERRORRelay signal invalid or malfunctioninfo
132/046Tilt invalid CORRELATION_ERRORSignal correlation check failedinfo
132/047Tilt invalid UPPER_OPTICAL_FORK_REACHED_ERRORUpper optical fork limit reached unexpectedlyinfo
132/048Tilt invalid LOWER_OPTICAL_FORK_REACHED_ERRORLower optical fork limit reached unexpectedlyinfo
132/049Tilt invalid FORCE_SENSOR_DEFECT_ERRORForce sensor malfunction detectedinfo
132/050Tilt invalid UNCONTROLLED_MOTION_ERRORMotion occurred without control signalinfo
132/051Tilt invalid ABSOLUTE_ENCODER_RANGE_ERRORAbsolute encoder position out of valid rangeinfo
132/052Tilt invalid FORCE_SENSOR_RANGE_ERRORForce sensor reading out of valid rangeinfo
132/053Tilt invalid SOFTWARE_ERRORGeneral software/firmware errorinfo
132/054Tilt invalid GO_ROTATION_FAILURERotation motion command execution failedinfo
132/055Tilt invalid GO_ANGULATION_FAILUREAngulation motion command execution failedinfo
132/056Tilt invalid OVERSPEED_ERRORMotion speed exceeded acceptable limitinfo
132/057Tilt invalid UNDERSPEED_ERRORMotion speed below acceptable minimuminfo
132/058Tilt invalid POSITION_ERRORMotor position does not match expected positioninfo
132/059Tilt invalid DECELERATION_ERRORMotion deceleration failed or incorrectinfo
132/060Tilt invalid MOVEMENT_REVERSE_DIRECTION_ERRORMotion reversed direction unexpectedlyinfo
132/061Tilt invalid INTERNAL_SOFTWARE_ERRORInternal firmware processing errorinfo
132/062Tilt invalid DSP_TIMEOUT_ELAPSED_ERRORDSP processing did not complete within timeoutinfo
132/063Tilt invalid TRANSMIT_QUEUE_FULL_ERRORTransmit message queue is fullinfo
132/064Tilt invalid NO_PREVIOUS_UIF_EVENT_ERRORUser interface event expected but not foundinfo
132/065Tilt invalid STOP_ON_VALID_MOTION_DOWN_ERRORValid downward motion stop sequence failedinfo
132/066Tilt invalid VALID_MOTION_ACTIVE_ERRORValid motion detected when not expectedinfo
132/067Tilt invalid STOP_ON_UIF_RELEASE_ERRORMotion stop on UIF button release failedinfo
132/068Tilt invalid LIFT_DOWN_PEDAL_PRESS_ERROROccurs when the lift down pedal is depressedinfo
132/069Tilt invalid LIFT_UP_PEDAL_PRESS_ERROROccurs when the lift up pedal is depressedinfo
132/070Tilt invalid COMPRESSION_PEDAL_PRESS_ERROROccurs when the compression pedal is depressedinfo
132/071Tilt invalid DECOMPRESSION_PEDAL_PRESS_ERROROccurs when the decompression pedal is depressedinfo
140/001Collimator setup table corruptChecksum error after loading setup table at power-uperror
140/002Collimator FPGA configuration failedFPGA configuration failure at power-up from flash memoryerror
140/003Collimator front blade homing failureAxis homing failure at power-up; optical sensor transition not reachederror
140/004Collimator left blade homing failureLeft blade axis homing failure at power-uperror
140/005Collimator rear blade homing failureRear blade axis homing failure at power-uperror
140/006Collimator right blade homing failureRight blade axis homing failure at power-uperror
140/007Collimator filter homing failureFilter wheel axis homing failure at power-uperror
141/001Collimator front blade not readyGantry CPU sends command while axis not in ready statuserror
141/002Collimator left blade not readyGantry CPU sends command while left blade axis not in ready statuserror
141/003Collimator rear blade not readyGantry CPU sends command while rear blade axis not in ready statuserror
141/004Collimator right blade not readyGantry CPU sends command while right blade axis not in ready statuserror
141/005Collimator filter not readyGantry CPU sends command while filter axis not in ready statuserror
141/006Collimator out of FOV (front)Invalid parameter for axis; wrong FOV value or filter type receivederror
141/007Collimator out of FOV (left)Invalid parameter for left blade axis; wrong FOV value or filter typeerror
141/008Collimator out of FOV (rear)Invalid parameter for rear blade axis; wrong FOV value or filter typeerror
141/009Collimator out of FOV (right)Invalid parameter for right blade axis; wrong FOV value or filter typeerror
141/010Collimator filter type not existInvalid filter type parameter received by collimatorerror
141/011Collimator beyond physical limit (front)FOV command exceeds blade capability on front axiserror
141/012Collimator beyond physical limit (left)FOV command exceeds blade capability on left axiserror
141/013Collimator beyond physical limit (rear)FOV command exceeds blade capability on rear axiserror
141/014Collimator beyond physical limit (right)FOV command exceeds blade capability on right axiserror
141/016Collimator front blade timeoutFront blade axis does not reach target position within timeout limiterror
141/017Collimator left blade timeoutLeft blade axis does not reach target position within timeout limiterror
141/018Collimator rear blade timeoutRear blade axis does not reach target position within timeout limiterror
141/019Collimator right blade timeoutRight blade axis does not reach target position within timeout limiterror
141/020Collimator filter timeoutFilter wheel axis does not reach target position within timeout limiterror
141/021Collimator PDO1 length errorPDO message from gantry CPU contains incorrect number of data byteserror
141/022Collimator PDO2 length errorPDO2 (change filter type) message contains incorrect number of data byteserror
141/023Collimator PDO3 length errorPDO3 (lamp on/off) message contains incorrect number of data byteserror
141/024Collimator PDO4 length errorPDO4 (change focal spot) message contains incorrect number of data byteserror
142/001Collimator 12V lamp power failure12 VDC power loss to centering lampwarning
142/003Collimator front blade overcurrentMotor current exceeds threshold or abnormal noise detected on control boarderror
142/004Collimator left blade overcurrentMotor current exceeds threshold or abnormal noise detected on control boarderror
142/005Collimator rear blade overcurrentMotor current exceeds threshold or abnormal noise detected on control boarderror
142/006Collimator right blade overcurrentMotor current exceeds threshold or abnormal noise detected on control boarderror
142/007Collimator filter overcurrentMotor current exceeds threshold or abnormal noise detected on control boarderror
142/011Cannot reach requested filter positionOptical sensor signal not received at expected position during filter position changeerror
152/000PDU 230V AC mains is out of spec limitsAC mains voltage exceeds specified operating rangewarning
152/00112VDC generator voltage off12V DC from generator not presentwarning
152/00248V DC channel errorAC/DC module turned on but no 48V DC detectedwarning
152/003Power fail in AC/DC moduleAC/DC module power failure detectedwarning
152/004AC/DC module fan failureFan in AC/DC module non-operationalinfo
152/005AC/DC module over temperatureAC/DC module internal temperature exceeds limitswarning
152/006Internal 12VDC voltage out of spec limitsRegulated 12V DC voltage outside specified rangeinfo
152/007Total current consumption too highPDU total current consumption exceeds 40Awarning
152/008GND offset level PDU ground too highPDU ground level exceeds acceptable noise thresholdwarning
152/009Internal 13.3V voltage out of spec limits13.3V regulated supply outside specified rangeinfo
152/010Internal 5V DC voltage out of spec limits5V DC regulated supply outside specified rangeinfo
152/011Negative unregulated voltage out of spec limitsNegative unregulated supply from transformer outside limitsinfo
152/012Positive unregulated voltage out of spec limitsPositive unregulated supply from transformer outside limitsinfo
152/013Internal -5V DC voltage out of spec limitsNegative 5V regulated supply outside specified rangeinfo
152/014Internal 5V DC voltage out of spec limits5V DC regulated supply outside specified rangeinfo
152/015Internal reference voltage for AD conversions out of specA/D conversion reference voltage outside limitsinfo
152/019Internal 0.6V bad, measurement circuit error0.6V reference circuit malfunction detected during self-testinfo
152/020Internal EEPROM errorPDU MCU EEPROM read/write failure or empty EEPROM on first power-oninfo
152/021PDU MCU reset while system onPDU microcontroller unexpected reset during operationwarning
152/022A/D converter module error on PDU boardA/D converter chip (U13) malfunction detectederror
152/023Diagnostic channel selection circuit failurePDU internal diagnostic multiplexer failureinfo
152/024Internal software errorPDU firmware detects logic or memory access violationwarning
152/025Temperature too high or too lowMPCB box internal temperature outside +9 to +60°C rangeinfo
152/026Low power 2 fuse failureFuse F1 to nodes is open or faultycritical
152/027High power fuse failureFuse F2 to motors is open or faultycritical
152/028Low power 1 fuse failureFuse F3 to nodes is open or faultycritical
152/029CPU fuse failureFuse F4 is open or faultyerror
152/030Generator on/off relay failureGenerator control relay or driver detects over/under current on coilcritical
152/031Spare relay failureSpare relay or its driver absent or faultywarning
152/032Internal A/D converter failureInternal A/D converter error detectederror
152/033Generator cannot be turned off by PDUGenerator relay failed to turn off generator or comms brokencritical
160/000Internal software error - out of memoryFunctional device, configuration interface, or HAL device creation fails during startupcritical
160/001CORBA extraction failedCORBA object extraction failure during initializationcritical
160/002Unknown attribute change notification receivedUnrecognized HAL signal, Atlas event, or attribute change notificationcritical
160/003Configuration file read failureGantry CPU unable to read configuration file at startupcritical
160/004Configuration data retrieval failedGantry CPU unable to retrieve configuration datacritical
160/005Subscription failure for Atlas events or HAL signalsAtlas event, attribute change, or HAL signal subscription failscritical
160/006State machine file access failureGantry CPU unable to access state machine filecritical
160/007Attribute get failureGantry CPU failed to retrieve an attribute valuecritical
160/008Attribute set failureGantry CPU unable to set an attribute valuecritical
160/009Event publish failureGantry CPU unable to publish an eventcritical
160/011Unhandled error code from known nodeError code received from network node not handled by current Gantry CPU releasecritical
161/001Unknown UIF request receivedGantry CPU receives unrecognized UIF (user interface function) requestcritical
161/008Lift not operationalLift UIF request received while lift node is not operationalinfo
161/009Rotation not operationalRotation UIF request while rotation node is not operationalinfo
161/010Compression not operationalCompression UIF request while compression node is not operationalinfo
161/011Multiple incompatible motions requestedCompression motion stopped due to inconsistent/simultaneous UIF requestinfo
161/012Multiple incompatible lift motions requestedLift motion stopped by inconsistent UIF requestinfo
161/013Multiple incompatible rotation motions requestedRotation motion stopped by inconsistent UIF requestinfo
161/014Rotation rejected due to active compressionRotation UIF rejected while compression motion is activeinfo
161/015Rotation rejected due to active lift motionRotation UIF rejected while lift motion is activeinfo
161/016Rotation rejected due to applied compression forceRotation UIF rejected while compression force is appliedinfo
161/017Lift rejected due to active compression motionLift UIF rejected while compression motion is activeinfo
161/018Lift rejected due to active lift motionLift UIF rejected while lift motion is already activeinfo
161/019Lift rejected due to applied compression forceLift UIF rejected while compression force is appliedinfo
161/020Compression rejected due to active rotationCompression UIF rejected while rotation motion is activeinfo
161/021Compression rejected due to active rotation liftCompression UIF rejected while rotation/lift motion is activeinfo
161/022Rotation already at end positionRotation UIF rejected because gantry is already at rotation end positioninfo
161/023Lift already at end positionLift UIF rejected because lift is already at end positioninfo
161/024Compression already at upper positionCompression UIF rejected because compression is already in topmost positioninfo
161/025Maximum power-driven compression force reachedPower-driven compression has reached maximum permissible forceinfo
161/026Maximum manual compression force reachedManual compression has reached maximum permissible forceinfo
161/027Risk of collision with floor - lift motion stoppedLift motion stopped or UIF request rejected due to potential floor collisioninfo
161/028Risk of collision with floor - rotation stoppedRotation motion stopped or UIF rejected due to potential floor collisioninfo
161/030Compression control failure - node did not startCompression node fails to send acknowledgement at power-up to Gantry CPUcritical
161/031Lift control failure - node did not startLift node fails to send acknowledgement at power-up to Gantry CPUcritical
161/032Rotation control failure - node did not startRotation node fails to send acknowledgement at power-up to Gantry CPUcritical
161/036Lift node not respondingLift node fails to send heartbeat signal (every second) or actual value messagescritical
161/037Rotation node not respondingRotation node fails to send heartbeat signal (every second) or actual value messagescritical
161/038Compression node not respondingCompression node fails to send heartbeat or actual value messages during motioncritical
161/039Unknown error code from lift nodeGantry CPU receives unrecognized error code from lift nodecritical
161/040Unknown error code from rotation nodeGantry CPU receives unrecognized error code from rotation nodecritical
161/041Unknown error code from compression nodeGantry CPU receives unrecognized error code from compression nodecritical
161/043Rotation node communication failureRotation node failed to communicate with Gantry CPU or TP2 connector is closedcritical
161/050Compression node communication failureCompression node failed to communicate with Gantry CPUcritical
161/051Lift node communication failureLift node failed to communicate with Gantry CPUcritical
161/052Breast support locking mechanism node not respondingIR lock node not responding to Gantry CPUwarning
162/000Lift node unknown error code receivedGantry CPU received unknown error code from lift nodewarning
162/001Tube tilt can affect image qualityGantry CPU received unknown error code from tilt nodewarning
162/003Tilt node failed to startTilt node did not send acknowledgement at power-up or TP1 connector is closedcritical
162/005Grid node failed to startGrid node did not send acknowledgement at power-upcritical
162/006Tilt node not respondingHeartbeat signal not sent by tilt node or TP1 connector is closedwarning
162/007Grid node not respondingCAN cables faulty or heartbeat signal not sent by grid nodewarning
162/008Risk of collision with floorActive angulation motion stopped or angulation request rejected due to collision detectioninfo
162/016Move tube head to center positionAngulation not at 0 degreesinfo
162/019Compression status is unknownCompression status cannot be determinedinfo
162/020Move up the paddle holderPaddle holder position issueinfo
162/021Angulation mode not allowedAngulation mode request refusedinfo
162/022Rotation mode not allowedRotation mode request refusedinfo
162/023Risk of collision with puncture toolMotion stopped due to collision risk with guninfo
162/024Move tube head to center positionTube head not at center positioninfo
162/032X-ray source focus status unknownCurrent x-ray source focus status not known by Gantry CPUwarning
162/033X-ray source track status unknownCurrent x-ray source track status not known by Gantry CPUwarning
163/000Invalid image receptor typeInvalid image receptor type received by Gantry CPUerror
163/001Invalid paddle type detectedInvalid paddle type received by Gantry CPUerror
163/005Invalid button function identity receivedInvalid button function identity received by Gantry CPUcritical
163/006Invalid button state receivedInvalid button state received by Gantry CPUcritical
163/007Button state inconsistencyLift or rotation button counter overflow or underflowcritical
163/105Invalid language configurationInvalid language currently configured; English used as defaultwarning
164/001Blade format outside field of viewBlade configuration in collimator outside current FOV settingwarning
164/002Machine event with unexpected stateGantry CPU received machine event with unexpected statewarning
164/003Collimator communication timeoutTimeout waiting for collimator response on Gantry CPUerror
164/004Unable to load collimator parametersGantry CPU unable to load collimator parameterserror
164/005Unknown error code from collimator nodeGantry CPU received unknown error code from collimatorerror
164/006Collimator node failed to startCollimator node did not send acknowledgement at power-upcritical
164/008Collimator node not respondingHeartbeat signal not sent by collimator nodewarning
165/000Invalid serial port configurationInvalid serial port configuration prevents Gantry CPU-Generator communicationcritical
165/001COM port hardware errorHardware error with COM port prevents Gantry CPU-Generator communicationcritical
165/002Received message number mismatchReceived message number does not match expectederror
165/003Received message BCC mismatchReceived message block check character does not matcherror
165/004RX buffer fullReceive buffer overflowerror
165/005TX Buffer FULLInternal software errorerror
165/006GENERATOR DISCONNECTEDGenerator not connected or powered downerror
165/007Events count not foundInternal software errorerror
165/008Event number from the list not definedInternal software errorerror
165/009Revision description not found in fileInternal software errorwarning
165/010Messages count not foundInternal software errorerror
165/011Messages number from the list not definedInternal software errorerror
165/014Message count not definedInternal software errorerror
165/015Message list not definedInternal software errorerror
165/016Simulation Message description errorInternal software errorerror
165/017Simulation Message Flag description errorInternal software errorerror
165/018Message description errorInternal software errorerror
166/000OPEN SOCKET FAILEDOpen socket operation failureerror
166/001CLOSE SOCKET FAILEDClose socket operation failureerror
166/002ACCEPT CONNECTION FAILEDIncoming connection acceptance failureerror
166/003TCP/IP PACKET TRANSMISSION FAILEDTCP/IP packet transmission failure from gantryerror
166/004TCP/IP PACKET RECEPTION FAILEDTCP/IP packet reception failure to gantryerror
166/005TCP/IP PACKET TOO LONGTCP/IP packet received but too longerror
166/006TCP/IP PACKET WITH WRONG SIZETCP/IP packet received with wrong sizeerror
166/007ADS IS NOT CONNECTED - TRANSMIT FAILEDMessage cannot be sent to ADSerror
167/001PDU NODE NOT STARTEDPDU node did not send acknowledgement at power-upcritical
167/002PDU NODE NOT RESPONDINGHeartbeat signal was not sent by PDU nodecritical
167/003INTERNAL SOFTWARE ERRORUnknown error code received from PDU nodecritical
167/004EMCY LINE FAILURE ON COMPRESSION NODEStop motion simulation fault or TP1 connector closedcritical
167/005EMCY STOP LINE ACTIVATEDEmergency stop line is activatedcritical
167/006NVRAM CHECKSUM ERRORNVRAM checksum error on Gantry CPUcritical
167/007EMCY LINE FAILURE ON LIFT NODEStop motion simulation fault or TP2 connector closedcritical
167/008EMCY LINE FAILURE ON ROTATION NODEStop motion simulation fault or TP2 connector closedcritical
167/009INCORRECT GANTRY CONFIGURATIONField of view setting does not match paddle positioninfo
170/000Grid node error - invalid command sent by PoseidonExposure time out of range or invalid command from Poseidon systemerror
170/001Grid node error - command queue delayCommand received while previous command still processinginfo
170/002Grid node error - CAN bus overrunCAN bus overrun condition with data losserror
170/003Grid node error - invalid PDO lengthCAN PDO (Process Data Object) received with incorrect lengtherror
170/004Grid node error - Gantry CPU heartbeat lostNo heartbeat signal received from Gantry CPU within timeout perioderror
170/005Grid node error - correlation error with Bucky step lostData correlation failure linked to Bucky step motor losswarning
170/006Grid node info - exposure time calculation adjustmentExposure time between 20 and 50 msinfo
190/000Right breast support release button still pressed at bootRelease button pressed when system bootswarning
191/000Release optical fork test failedOptical fork self-test fails at startupcritical
191/001Lock optical fork test failedLock optical fork self-test fails at startupcritical
191/001Left breast support release button still pressed at bootLeft release button pressed when system bootswarning
191/002IRLOCK_CPLD_OPTICAL_FORK_ERRORHardware error in CPLD affecting optical forkcritical
191/003IRLOCK motor malfunctionMotor fails to operate or responds abnormallycritical
191/004IRLOCK motion timeoutLocking mechanism does not complete motion within expected timecritical
191/005IRLOCK release left button timeoutLeft release button press does not complete within expected timewarning
191/006IRLOCK release right button timeoutRight release button press does not complete within expected timewarning
191/007IR lock/release motion stopped due to button pressUser presses button during lock or release motioninfo
191/008IR lock/release motion stopped - IR type lostBreast support not registered via IR code during operationcritical
191/009IR type lost and not releasedBreast support not registered via IR code; cannot release mechanismcritical
191/010IR release fork inactive while lock command receivedRelease fork does not respond while lock command is activewarning
191/011IR release fork inactive while lock command - debug onlyDebug-only error indicationinfo
191/013IR lock/release movement not startedInternal motion state machine errorerror
191/014IRLOCK invalid messageInvalid message during inter-task communicationerror
191/015IRLOCK CAN command not processedGantry CPU sends new command before previous acknowledgedinfo
191/016IRLOCK invalid PDO lengthPDO with invalid DLC received by boardwarning
192/000Press both breast support locking buttons to releaseOperator held right release button longer than 1 secondunknown
192/001Press both breast support locking buttons to releaseOperator held left release button longer than 1 secondunknown
192/002Press both breast support locking buttons to releaseIR interlock release failure occurredinfo
192/003IR interlock lock failure occurredIR interlock lock failure during operationinfo
193/000IRLOCK node firmware incompatibilityHardware configuration (CPLD) of node or DSP/MCU firmware do not matcherror
193/001IRLOCK node parity errorParity bit does not set correctly on on-board bus between CPLD and MCUerror
193/002Stop motion safety active (debug only)System detected stop motion safety condition activewarning
193/003IRLOCK invalid user interface errorButton timeout error reported by the CPLDwarning
193/004Low voltage error on IRLOCK nodePower supply voltage falls below 24Verror
193/005IRLOCK read timeout errorMCU has not reacted on interrupt request (IRQ) from CPLD before 15mserror
193/006IRLOCK XIRQ error (debug only)XIRQ error occurred during operationwarning
193/007IRLOCK CPLD memory errorCPLD test data does not match expected values during periodic verificationerror
193/008IRLOCK invalid internal software errorInternal software error detected on Breast Support Locking Mechanism Boardwarning
193/009IRLOCK CAN task stack lowCAN task stack low software error on Breast Support Locking Mechanism Boardwarning
193/010IRLOCK UIF task stack lowUIF task stack low software error on Breast Support Locking Mechanism Boardwarning
193/011IRLOCK ACK task stack lowACK task stack low software error on Breast Support Locking Mechanism Boardwarning
193/012IRLOCK MOT task stack lowMOT task stack low software error on Breast Support Locking Mechanism Boardwarning
193/013IRLOCK EEPROM task stack lowEEPROM task stack low software error on Breast Support Locking Mechanism Boardwarning
193/014IRLOCK BKG task stack lowBKG task stack low software error on Breast Support Locking Mechanism Boardwarning
193/015IRLOCK RX CAN buffer overrunInput queue of incoming CAN messages of the MCU is full; message droppederror
193/016IRLOCK TX CAN buffer overrunTransmit queue between MCU and DSP is full; message droppederror
193/017IRLOCK mailbox overrunMailbox queue used in inter-task communication in MCU is full; mails droppederror
193/018CPU heartbeat not received by IRLOCK nodeGantry CPU did not send periodic heartbeat CAN message to Breast Support Locking Mechanism Boarderror
193/019Heartbeat disabled on IRLOCK node (debug only)Gantry CPU tried to disable heartbeat check of Breast Support Locking Mechanism Boardwarning
E55Tube angulation faultAbnormal tube angle detected during positioningerror

Likely causes and actions for each code are in ServiceForge. Connect ServiceForge to your AI

Community

0 fixes logged by technicians through their AI, with outcomes, for this model.

ServiceForge knowledge base record. Field-unverified unless technicians confirmed it. A teaching summary of the record, not a service manual. Export 2026-10-14.